
-- TWI01 : where with basic in statement

select * from names where firstName in (select firstName from names where firstName="zero" or firstName="Zero");

ID|FIRSTNAME|LASTNAME
0|Zero|Cool
5|Zero|Cool
(2 rows)
;; This is a generated file; do not modify. Generated M code corresponds to below SQL query
;; ---------------------------------------------------------
;  select * from names where firstName in (select firstName from names where firstName="zero" or firstName="Zero");
;; ---------------------------------------------------------

octoPlan0(cursorId,wrapInTp)
    DO:'$DATA(^%ydboctoocto("xref_status","NAMES","FIRSTNAME")) xrefPlan^%ydboctoXS6loYoNNto55iv2lHkNkCK(cursorId)
    TSTART:wrapInTp ():(serial)
    DO octoPlan1(cursorId)
    DO octoPlan2(cursorId)
    DO octoPlan3(cursorId)
    TCOMMIT:wrapInTp
    QUIT

octoPlan1(cursorId)
    NEW %ydboctoz KILL %ydboctocursor(cursorId,"keys",5,"","")
    DO
    . SET %ydboctoexpr=$GET(%ydboctocursor(cursorId,"parameters",1))
    SET %ydboctocursor(cursorId,"keys",2,"NAMES","FIRSTNAME")=%ydboctoexpr IF '$ZYISSQLNULL(%ydboctocursor(cursorId,"keys",2,"NAMES","FIRSTNAME")) IF $DATA(^%ydboctoxref("NAMES","FIRSTNAME",%ydboctocursor(cursorId,"keys",2,"NAMES","FIRSTNAME"))) DO
    . SET %ydboctocursor(cursorId,"keys",2,"NAMES","ID")=""
    . FOR  SET %ydboctocursor(cursorId,"keys",2,"NAMES","ID")=$ORDER(^%ydboctoxref("NAMES","FIRSTNAME",%ydboctocursor(cursorId,"keys",2,"NAMES","FIRSTNAME"),%ydboctocursor(cursorId,"keys",2,"NAMES","ID"))) QUIT:(%ydboctocursor(cursorId,"keys",2,"NAMES","ID")="")  DO
    . . NEW %ydboctoexpr SET %ydboctoexpr=1
    . . SET %ydboctoexpr=%ydboctoexpr&('$DATA(%ydboctozduplicate(5,%ydboctocursor(cursorId,"keys",2,"NAMES","ID"))))
    . . IF %ydboctoexpr DO
    . . . SET %ydboctoexpr=%ydboctocursor(cursorId,"keys",2,"NAMES","FIRSTNAME")
    . . . IF $INCREMENT(%ydboctocursor(cursorId,"keys",5,"","",%ydboctoexpr))
    . . . SET %ydboctozduplicate(5,%ydboctocursor(cursorId,"keys",2,"NAMES","ID"))=1
    QUIT

octoPlan2(cursorId)
    NEW %ydboctoz
    DO
    . SET %ydboctoexpr=$GET(%ydboctocursor(cursorId,"parameters",2))
    SET %ydboctocursor(cursorId,"keys",2,"NAMES","FIRSTNAME")=%ydboctoexpr IF '$ZYISSQLNULL(%ydboctocursor(cursorId,"keys",2,"NAMES","FIRSTNAME")) IF $DATA(^%ydboctoxref("NAMES","FIRSTNAME",%ydboctocursor(cursorId,"keys",2,"NAMES","FIRSTNAME"))) DO
    . SET %ydboctocursor(cursorId,"keys",2,"NAMES","ID")=""
    . FOR  SET %ydboctocursor(cursorId,"keys",2,"NAMES","ID")=$ORDER(^%ydboctoxref("NAMES","FIRSTNAME",%ydboctocursor(cursorId,"keys",2,"NAMES","FIRSTNAME"),%ydboctocursor(cursorId,"keys",2,"NAMES","ID"))) QUIT:(%ydboctocursor(cursorId,"keys",2,"NAMES","ID")="")  DO
    . . NEW %ydboctoexpr SET %ydboctoexpr=1
    . . SET %ydboctoexpr=%ydboctoexpr&('$DATA(%ydboctozduplicate(5,%ydboctocursor(cursorId,"keys",2,"NAMES","ID"))))
    . . IF %ydboctoexpr DO
    . . . SET %ydboctoexpr=%ydboctocursor(cursorId,"keys",2,"NAMES","FIRSTNAME")
    . . . IF $INCREMENT(%ydboctocursor(cursorId,"keys",5,"","",%ydboctoexpr))
    . . . SET %ydboctozduplicate(5,%ydboctocursor(cursorId,"keys",2,"NAMES","ID"))=1
    KILL %ydboctozduplicate(5)
    QUIT

octoPlan3(cursorId)
    NEW %ydboctoz KILL %ydboctocursor(cursorId,"keys",8,"","")
    SET %ydboctocursor(cursorId,"keys",1,"NAMES","ID")=""
    FOR  SET %ydboctocursor(cursorId,"keys",1,"NAMES","ID")=$ORDER(^names(%ydboctocursor(cursorId,"keys",1,"NAMES","ID"))) QUIT:(%ydboctocursor(cursorId,"keys",1,"NAMES","ID")="")  DO
    . NEW %ydboctoexpr SET %ydboctoexpr=1
    . SET %ydboctoexpr=$PIECE($GET(^names(%ydboctocursor(cursorId,"keys",1,"NAMES","ID"))),"|",1) SET:(""=%ydboctoexpr) %ydboctoexpr=$ZYSQLNULL
    . SET %ydboctoexpr(1)=%ydboctoexpr
    . SET %ydboctoexpr=$SELECT($ZYISSQLNULL(%ydboctoexpr(1)):$ZYSQLNULL,$DATA(%ydboctocursor(cursorId,"keys",5,"","",%ydboctoexpr(1))):1,$DATA(%ydboctocursor(cursorId,"keys",5,"","",$ZYSQLNULL)):$ZYSQLNULL,1:0)
    . IF %ydboctoexpr DO
    . . SET:1&$INCREMENT(%ydboctocursor(cursorId,"keys",8,"","")) %ydboctoz=42
    . . SET %ydboctoexpr=%ydboctocursor(cursorId,"keys",1,"NAMES","ID")
    . . SET %ydboctoexpr=$$str2mval^%ydboctoplanhelpers(%ydboctoexpr)
    . . SET %ydboctoexpr(0)=%ydboctoexpr
    . . SET %ydboctoexpr=$PIECE($GET(^names(%ydboctocursor(cursorId,"keys",1,"NAMES","ID"))),"|",1) SET:(""=%ydboctoexpr) %ydboctoexpr=$ZYSQLNULL
    . . SET %ydboctoexpr=$$str2mval^%ydboctoplanhelpers(%ydboctoexpr)
    . . SET %ydboctoexpr=%ydboctoexpr(0)_%ydboctoexpr
    . . SET %ydboctoexpr(0)=%ydboctoexpr
    . . SET %ydboctoexpr=$PIECE($GET(^names(%ydboctocursor(cursorId,"keys",1,"NAMES","ID"))),"|",2) SET:(""=%ydboctoexpr) %ydboctoexpr=$ZYSQLNULL
    . . SET %ydboctoexpr=$$str2mval^%ydboctoplanhelpers(%ydboctoexpr)
    . . SET %ydboctoexpr=%ydboctoexpr(0)_%ydboctoexpr
    . . SET %ydboctocursor(cursorId,"keys",8,"","",%ydboctocursor(cursorId,"keys",8,"",""))=%ydboctoexpr
    QUIT
