FIRSTNAME|FIRSTNAME|FIRSTNAME
Zero|Zero|Zero
Acid|Acid|Acid
Cereal|Cereal|Cereal
Lord|Lord|Lord
Joey|Joey|Joey
Zero|Zero|Zero
(6 rows)
;; This is a generated file; do not modify. Generated M code corresponds to below SQL query
;; ---------------------------------------------------------
;  SELECT t1.firstName, t2.firstName, t3.firstName
;  FROM names t1
;  INNER JOIN names t2
;  ON t1.id = t2.id
;  INNER JOIN names t3
;  ON t2.id = t3.id;
;; ---------------------------------------------------------

octoPlan0(cursorId,wrapInTp)
    TSTART:wrapInTp ():(serial)
    DO octoPlan1(cursorId)
    TCOMMIT:wrapInTp
    QUIT

octoPlan1(cursorId)
    NEW %ydboctoz KILL %ydboctocursor(cursorId,"keys",5,"","")
    SET %ydboctocursor(cursorId,"keys",1,"NAMES","ID")=""
    FOR  SET %ydboctocursor(cursorId,"keys",1,"NAMES","ID")=$ORDER(^names(%ydboctocursor(cursorId,"keys",1,"NAMES","ID"))) QUIT:(%ydboctocursor(cursorId,"keys",1,"NAMES","ID")="")  DO
    . SET %ydboctoexpr=%ydboctocursor(cursorId,"keys",1,"NAMES","ID")
    . SET %ydboctocursor(cursorId,"keys",2,"NAMES","ID")=%ydboctoexpr IF '$ZYISSQLNULL(%ydboctocursor(cursorId,"keys",2,"NAMES","ID")) IF $DATA(^names(%ydboctocursor(cursorId,"keys",2,"NAMES","ID"))) DO
    . . SET %ydboctoexpr=%ydboctocursor(cursorId,"keys",2,"NAMES","ID")
    . . SET %ydboctocursor(cursorId,"keys",3,"NAMES","ID")=%ydboctoexpr IF '$ZYISSQLNULL(%ydboctocursor(cursorId,"keys",3,"NAMES","ID")) IF $DATA(^names(%ydboctocursor(cursorId,"keys",3,"NAMES","ID"))) DO
    . . . NEW %ydboctoexpr SET %ydboctoexpr=1
    . . . IF %ydboctoexpr DO
    . . . . SET:1&$INCREMENT(%ydboctocursor(cursorId,"keys",5,"","")) %ydboctoz=42
    . . . . SET %ydboctoexpr=$PIECE($GET(^names(%ydboctocursor(cursorId,"keys",1,"NAMES","ID"))),"|",1) SET:(""=%ydboctoexpr) %ydboctoexpr=$ZYSQLNULL
    . . . . SET %ydboctoexpr=$$str2mval^%ydboctoplanhelpers(%ydboctoexpr)
    . . . . SET %ydboctoexpr(0)=%ydboctoexpr
    . . . . SET %ydboctoexpr=$PIECE($GET(^names(%ydboctocursor(cursorId,"keys",2,"NAMES","ID"))),"|",1) SET:(""=%ydboctoexpr) %ydboctoexpr=$ZYSQLNULL
    . . . . SET %ydboctoexpr=$$str2mval^%ydboctoplanhelpers(%ydboctoexpr)
    . . . . SET %ydboctoexpr=%ydboctoexpr(0)_%ydboctoexpr
    . . . . SET %ydboctoexpr(0)=%ydboctoexpr
    . . . . SET %ydboctoexpr=$PIECE($GET(^names(%ydboctocursor(cursorId,"keys",3,"NAMES","ID"))),"|",1) SET:(""=%ydboctoexpr) %ydboctoexpr=$ZYSQLNULL
    . . . . SET %ydboctoexpr=$$str2mval^%ydboctoplanhelpers(%ydboctoexpr)
    . . . . SET %ydboctoexpr=%ydboctoexpr(0)_%ydboctoexpr
    . . . . SET %ydboctocursor(cursorId,"keys",5,"","",%ydboctocursor(cursorId,"keys",5,"",""))=%ydboctoexpr
    QUIT
