
-- TWI03 : where IN references grandparent query

SELECT *
FROM names a
WHERE a.firstName IN (
    SELECT b.firstName
    FROM names b
    WHERE b.id IN (SELECT c.id
        FROM names c
        WHERE c.id = a.id)
);

ID|FIRSTNAME|LASTNAME
0|Zero|Cool
1|Acid|Burn
2|Cereal|Killer
3|Lord|Nikon
4|Joey|
5|Zero|Cool
(6 rows)
;; This is a generated file; do not modify. Generated M code corresponds to below SQL query
;; ---------------------------------------------------------
;  SELECT *
;  FROM names a
;  WHERE a.firstName IN (
;      SELECT b.firstName
;      FROM names b
;      WHERE b.id IN (SELECT c.id
;          FROM names c
;          WHERE c.id = a.id)
;  );
;; ---------------------------------------------------------

octoPlan0(cursorId,wrapInTp)
    TSTART:wrapInTp ():(serial)
    DO octoPlan1(cursorId)
    TCOMMIT:wrapInTp
    QUIT

octoPlan1(cursorId)
    NEW %ydboctoz KILL %ydboctocursor(cursorId,"keys",9,"","")
    SET %ydboctocursor(cursorId,"keys",1,"NAMES","ID")=""
    FOR  SET %ydboctocursor(cursorId,"keys",1,"NAMES","ID")=$ORDER(^names(%ydboctocursor(cursorId,"keys",1,"NAMES","ID"))) QUIT:(%ydboctocursor(cursorId,"keys",1,"NAMES","ID")="")  DO
    . DO octoPlan2(cursorId)
    . DO octoPlan3(cursorId)
    . NEW %ydboctoexpr SET %ydboctoexpr=1
    . SET %ydboctoexpr=$PIECE($GET(^names(%ydboctocursor(cursorId,"keys",1,"NAMES","ID"))),"|",1) SET:(""=%ydboctoexpr) %ydboctoexpr=$ZYSQLNULL
    . SET %ydboctoexpr(1)=%ydboctoexpr
    . SET %ydboctoexpr=$SELECT($ZYISSQLNULL(%ydboctoexpr(1)):$ZYSQLNULL,$DATA(%ydboctocursor(cursorId,"keys",8,"","",%ydboctoexpr(1))):1,$DATA(%ydboctocursor(cursorId,"keys",8,"","",$ZYSQLNULL)):$ZYSQLNULL,1:0)
    . IF %ydboctoexpr DO
    . . SET:1&$INCREMENT(%ydboctocursor(cursorId,"keys",9,"","")) %ydboctoz=42
    . . SET %ydboctoexpr=%ydboctocursor(cursorId,"keys",1,"NAMES","ID")
    . . SET %ydboctoexpr=$$str2mval^%ydboctoplanhelpers(%ydboctoexpr)
    . . SET %ydboctoexpr(0)=%ydboctoexpr
    . . SET %ydboctoexpr=$PIECE($GET(^names(%ydboctocursor(cursorId,"keys",1,"NAMES","ID"))),"|",1) SET:(""=%ydboctoexpr) %ydboctoexpr=$ZYSQLNULL
    . . SET %ydboctoexpr=$$str2mval^%ydboctoplanhelpers(%ydboctoexpr)
    . . SET %ydboctoexpr=%ydboctoexpr(0)_%ydboctoexpr
    . . SET %ydboctoexpr(0)=%ydboctoexpr
    . . SET %ydboctoexpr=$PIECE($GET(^names(%ydboctocursor(cursorId,"keys",1,"NAMES","ID"))),"|",2) SET:(""=%ydboctoexpr) %ydboctoexpr=$ZYSQLNULL
    . . SET %ydboctoexpr=$$str2mval^%ydboctoplanhelpers(%ydboctoexpr)
    . . SET %ydboctoexpr=%ydboctoexpr(0)_%ydboctoexpr
    . . SET %ydboctocursor(cursorId,"keys",9,"","",%ydboctocursor(cursorId,"keys",9,"",""))=%ydboctoexpr
    QUIT

octoPlan2(cursorId)
    NEW %ydboctoz KILL %ydboctocursor(cursorId,"keys",7,"","")
    DO
    . SET %ydboctoexpr=%ydboctocursor(cursorId,"keys",1,"NAMES","ID")
    SET %ydboctocursor(cursorId,"keys",3,"NAMES","ID")=%ydboctoexpr IF '$ZYISSQLNULL(%ydboctocursor(cursorId,"keys",3,"NAMES","ID")) IF $DATA(^names(%ydboctocursor(cursorId,"keys",3,"NAMES","ID"))) DO
    . NEW %ydboctoexpr SET %ydboctoexpr=1
    . IF %ydboctoexpr DO
    . . SET %ydboctoexpr=%ydboctocursor(cursorId,"keys",3,"NAMES","ID")
    . . IF $INCREMENT(%ydboctocursor(cursorId,"keys",7,"","",%ydboctoexpr))
    QUIT

octoPlan3(cursorId)
    NEW %ydboctoz KILL %ydboctocursor(cursorId,"keys",8,"","")
    SET %ydboctocursor(cursorId,"keys",2,"NAMES","ID")=""
    FOR  SET %ydboctocursor(cursorId,"keys",2,"NAMES","ID")=$ORDER(^names(%ydboctocursor(cursorId,"keys",2,"NAMES","ID"))) QUIT:(%ydboctocursor(cursorId,"keys",2,"NAMES","ID")="")  DO
    . NEW %ydboctoexpr SET %ydboctoexpr=1
    . SET %ydboctoexpr=%ydboctocursor(cursorId,"keys",2,"NAMES","ID")
    . SET %ydboctoexpr(1)=%ydboctoexpr
    . SET %ydboctoexpr=$SELECT($ZYISSQLNULL(%ydboctoexpr(1)):$ZYSQLNULL,$DATA(%ydboctocursor(cursorId,"keys",7,"","",%ydboctoexpr(1))):1,$DATA(%ydboctocursor(cursorId,"keys",7,"","",$ZYSQLNULL)):$ZYSQLNULL,1:0)
    . IF %ydboctoexpr DO
    . . SET %ydboctoexpr=$PIECE($GET(^names(%ydboctocursor(cursorId,"keys",2,"NAMES","ID"))),"|",1) SET:(""=%ydboctoexpr) %ydboctoexpr=$ZYSQLNULL
    . . IF $INCREMENT(%ydboctocursor(cursorId,"keys",8,"","",%ydboctoexpr))
    QUIT
