{
  "dirty": false,
  "raw": "v0.5.1-2656-g44d75e0b",
  "hash": "g44d75e0b",
  "distance": 2656,
  "tag": "v0.5.1",
  "semver": {
    "raw": "v0.5.1",
    "major": 0,
    "minor": 5,
    "patch": 1,
    "prerelease": [],
    "build": [],
    "version": "0.5.1"
  },
  "suffix": "2656-g44d75e0b",
  "semverString": "0.5.1+2656.g44d75e0b"
}