<svg xmlns="http://www.w3.org/2000/svg" width="36.397" height="36.397" viewBox="0 0 36.397 36.397">
  <g id="Group_16173" data-name="Group 16173" transform="translate(-17.596 -96.576)">
    <rect id="Rectangle" width="36.397" height="36.397" rx="18.199" transform="translate(17.596 96.576)" fill="#f35c5d"/>
    <g id="Group_2" data-name="Group 2" transform="translate(27.832 105.676)">
      <path id="Rectangle_3" data-name="Rectangle 3" d="M0,4.55A4.55,4.55,0,0,1,4.55,0H6.824a4.55,4.55,0,0,1,4.55,4.55v9.1H0Z" transform="translate(2.275 1.137)" fill="#fff"/>
      <circle id="Oval" cx="2.275" cy="2.275" r="2.275" transform="translate(5.687)" fill="#fff"/>
      <circle id="Oval_Copy" data-name="Oval Copy" cx="2.275" cy="2.275" r="2.275" transform="translate(5.687 13.649)" fill="#fff"/>
      <path id="Rectangle_4" data-name="Rectangle 4" d="M0,1.706A1.706,1.706,0,0,1,1.706,0H14.218a1.706,1.706,0,0,1,1.706,1.706h0a1.706,1.706,0,0,1-1.706,1.706H1.706A1.706,1.706,0,0,1,0,1.706Z" transform="translate(0 11.374)" fill="#fff"/>
    </g>
  </g>
</svg>
