{
  "type": "city",
  "uniqueId": "[(${props['City Unique ID']})]",
  "fullName": "[(${#strings.capitalize(#strings.toLowerCase(props['Display Name']))})]",
  "details": {
    [#th:block th:if="${props.get('Search Term') != null}" ]
      "searchTerms": [
          [#th:block th:each="item : ${props.get('Search Term')}" ]
            "[(${item})]"
          [/th:block]
      ]
    [/th:block]
  },
  "rank": [(${props['Rank']}?: 0)],
  "active": [(${props['Active']}?: false)]
}