<svg xmlns="http://www.w3.org/2000/svg" width="18" height="16" viewBox="0 0 18 16">
  <path id="heart-uncheck" d="M12,8A4.964,4.964,0,0,0,7.5,5,4.419,4.419,0,0,0,3,9.5C3,13,6.8,15.8,12,21c5.2-5.2,9-8,9-11.5A4.419,4.419,0,0,0,16.5,5,4.964,4.964,0,0,0,12,8Z" transform="translate(-3 -5)" fill="#fff"/>
</svg>
