<svg xmlns="http://www.w3.org/2000/svg" xmlns:xlink="http://www.w3.org/1999/xlink" width="181" height="131" viewBox="0 0 181 131">
  <defs>
    <clipPath id="clip-path">
      <rect id="Rectangle_5399" data-name="Rectangle 5399" width="181" height="131" transform="translate(39 4314)" fill="#211f20"/>
    </clipPath>
  </defs>
  <g id="Group_8840" data-name="Group 8840" transform="translate(-80 -3619)">
    <g id="Mask_Group_5" data-name="Mask Group 5" transform="translate(41 -695)" clip-path="url(#clip-path)">
      <g id="Group_8819" data-name="Group 8819" transform="translate(-12)">
        <ellipse id="Ellipse_407" data-name="Ellipse 407" cx="87.5" cy="16.5" rx="87.5" ry="16.5" transform="translate(54 4418.899)" fill="#616161"/>
        <g id="Group_8818" data-name="Group 8818" transform="translate(8941.521 -8162.274)">
          <path id="Path_3977" data-name="Path 3977" d="M639.248,586.9H541.029a12.144,12.144,0,0,1-12.144-12.144v-45a4.811,4.811,0,0,1,1.5-3.492l52.046-49.335a11.2,11.2,0,0,1,15.412,0l49.623,47.039a12.576,12.576,0,0,1,3.924,9.127v41.66A12.144,12.144,0,0,1,639.248,586.9Z" transform="translate(-9390.277 12010.5)" fill="#a2a2a4"/>
          <path id="Path_3978" data-name="Path 3978" d="M440.7,517.441H562.182v39.467a16.937,16.937,0,0,1-16.937,16.937H457.633A16.937,16.937,0,0,1,440.7,556.908Z" transform="translate(-9302.089 12023.556)" opacity="0.1"/>
          <rect id="Rectangle_5394" data-name="Rectangle 5394" width="90.349" height="90.349" rx="11.336" transform="translate(-8845.441 12502.331)" fill="#e31836"/>
          <path id="Path_3980" data-name="Path 3980" d="M558.106,520.883v49.654H467.757V520.883l45.174,21.835Z" transform="translate(-9313.198 12022.143)" opacity="0.1"/>
          <path id="Path_3981" data-name="Path 3981" d="M589.922,595.539l-57.883-27.977a2.348,2.348,0,0,0-3.371,2.115v48.135A7.333,7.333,0,0,0,536,625.145H643.842a7.333,7.333,0,0,0,7.333-7.333V570.5a2.866,2.866,0,0,0-4.113-2.58Z" transform="translate(-9390.188 11972.129)" fill="#c4c4c5"/>
          <rect id="Rectangle_5395" data-name="Rectangle 5395" width="25.267" height="3.573" transform="translate(-8837.657 12510.626)" fill="#f2f2f2"/>
          <rect id="Rectangle_5396" data-name="Rectangle 5396" width="75.035" height="2.042" transform="translate(-8839.699 12523.642)" fill="#f2f2f2"/>
          <rect id="Rectangle_5397" data-name="Rectangle 5397" width="75.035" height="2.042" transform="translate(-8839.699 12530.533)" fill="#f2f2f2"/>
          <rect id="Rectangle_5398" data-name="Rectangle 5398" width="75.035" height="2.042" transform="translate(-8839.699 12537.424)" fill="#f2f2f2"/>
          <ellipse id="Ellipse_406" data-name="Ellipse 406" cx="10.464" cy="10.483" rx="10.464" ry="10.483" transform="translate(-8852.205 12493.27)" fill="#fff"/>
          <path id="Path_3982" data-name="Path 3982" d="M553.514,485.945a12.506,12.506,0,1,0,12.506,12.506A12.506,12.506,0,0,0,553.514,485.945Zm-2.567,19.174-6.409-6.409,1.8-1.8,4.618,4.618,9.746-9.746,1.8,1.8-11.55,11.538Z" transform="translate(-9395.254 12005.538)"/>
        </g>
      </g>
    </g>
  </g>
</svg>
