<svg xmlns="http://www.w3.org/2000/svg" width="20.108" height="16.086" viewBox="0 0 20.108 16.086">
  <path id="Path_3963" data-name="Path 3963" d="M20.1,4H4.011a2.008,2.008,0,0,0-2,2.011L2,18.075a2.017,2.017,0,0,0,2.011,2.011H20.1a2.017,2.017,0,0,0,2.011-2.011V6.011A2.017,2.017,0,0,0,20.1,4Zm0,4.022-8.043,5.027L4.011,8.022V6.011l8.043,5.027L20.1,6.011Z" transform="translate(-2 -4)"/>
</svg>
