<svg xmlns="http://www.w3.org/2000/svg" width="17.443" height="17.446" viewBox="0 0 17.443 17.446">
  <g id="instagram-sketched" transform="translate(-0.449)">
    <path id="Path_3960" data-name="Path 3960" d="M17.847,5.129a6.375,6.375,0,0,0-.406-2.117A4.469,4.469,0,0,0,14.889.46,6.391,6.391,0,0,0,12.772.055C11.839.01,11.542,0,9.173,0s-2.665.01-3.6.051A6.377,6.377,0,0,0,3.461.457,4.257,4.257,0,0,0,1.914,1.466,4.3,4.3,0,0,0,.909,3.009,6.392,6.392,0,0,0,.5,5.126c-.044.934-.055,1.23-.055,3.6s.01,2.665.051,3.6a6.375,6.375,0,0,0,.406,2.117A4.468,4.468,0,0,0,3.458,16.99a6.392,6.392,0,0,0,2.117.406c.93.041,1.227.051,3.6.051s2.665-.01,3.6-.051a6.373,6.373,0,0,0,2.116-.406,4.462,4.462,0,0,0,2.553-2.553,6.4,6.4,0,0,0,.406-2.117c.041-.93.051-1.227.051-3.6s0-2.665-.044-3.6Zm-1.571,7.123a4.782,4.782,0,0,1-.3,1.619,2.894,2.894,0,0,1-1.656,1.656,4.8,4.8,0,0,1-1.619.3c-.92.041-1.2.051-3.524.051s-2.607-.01-3.524-.051a4.779,4.779,0,0,1-1.619-.3,2.685,2.685,0,0,1-1-.651,2.712,2.712,0,0,1-.651-1,4.8,4.8,0,0,1-.3-1.619c-.041-.92-.051-1.2-.051-3.524s.01-2.607.051-3.524a4.779,4.779,0,0,1,.3-1.619,2.652,2.652,0,0,1,.654-1,2.708,2.708,0,0,1,1-.651,4.8,4.8,0,0,1,1.619-.3c.92-.041,1.2-.051,3.524-.051s2.607.01,3.524.051a4.782,4.782,0,0,1,1.619.3,2.683,2.683,0,0,1,1,.651,2.712,2.712,0,0,1,.651,1,4.8,4.8,0,0,1,.3,1.619c.041.92.051,1.2.051,3.524s-.01,2.6-.051,3.521Zm0,0" fill="#fff"/>
    <path id="Path_3961" data-name="Path 3961" d="M129.431,124.5a4.482,4.482,0,1,0,4.482,4.482A4.483,4.483,0,0,0,129.431,124.5Zm0,7.389a2.907,2.907,0,1,1,2.907-2.907,2.908,2.908,0,0,1-2.907,2.907Zm0,0" transform="translate(-120.257 -120.257)" fill="#fff"/>
    <path id="Path_3962" data-name="Path 3962" d="M364.542,89.648A1.046,1.046,0,1,1,363.5,88.6,1.046,1.046,0,0,1,364.542,89.648Zm0,0" transform="translate(-349.664 -85.582)" fill="#fff"/>
  </g>
</svg>
