<svg xmlns="http://www.w3.org/2000/svg" width="24" height="24" viewBox="0 0 24 24">
  <path id="facebook-circle" d="M12,0A12,12,0,1,1,0,12,12,12,0,0,1,12,0Zm4,7.278V4.5H13.714c-2.1,0-3.428,1.6-3.428,3.889v1.667H8v2.777h2.286V19.5h2.857V12.833h2.286L16,10.056H13.143V8.944a1.5,1.5,0,0,1,1.714-1.666H16Z"/>
</svg>
