<svg id="Group_8592" data-name="Group 8592" xmlns="http://www.w3.org/2000/svg" width="93.348" height="75.097" viewBox="0 0 93.348 75.097">
  <g id="Group_8556" data-name="Group 8556" transform="translate(50.887 23.837)">
    <path id="Path_3607" data-name="Path 3607" d="M33.678,5A13.693,13.693,0,0,0,20,18.678h2.28a11.411,11.411,0,0,1,11.4-11.4Z" transform="translate(-16.581 -1.581)" fill="#fff"/>
    <path id="Path_3608" data-name="Path 3608" d="M43.4,17A11.411,11.411,0,0,1,32,28.4v2.28A13.693,13.693,0,0,0,45.678,17Z" transform="translate(-14.903 0.097)" fill="#fff"/>
    <g id="Ellipse_396" data-name="Ellipse 396" fill="none" stroke="#fff" stroke-width="1.5">
      <circle cx="17.097" cy="17.097" r="17.097" stroke="none"/>
      <circle cx="17.097" cy="17.097" r="16.347" fill="none"/>
    </g>
  </g>
  <g id="Group_8591" data-name="Group 8591" transform="translate(0)">
    <path id="Path_3605" data-name="Path 3605" d="M46.068,967.28a1.285,1.285,0,0,0-.836.335l-31.978,28.1a1.285,1.285,0,0,0,.87,2.241H46.837a1.288,1.288,0,1,0,0-2.576h-29.3L46.57,969.856l23.483.1-20.037,19.8a5,5,0,0,0-.535,6.389l.033.033.066.1.033.066.033-.033a3.923,3.923,0,0,0,2.776,1.639,3.253,3.253,0,0,0,.335,0,1.285,1.285,0,0,0-1,1.271v17.728a1.288,1.288,0,1,0,2.576,0V999.225a1.285,1.285,0,0,0-1.037-1.271,4.067,4.067,0,0,0,2.208-1.171l19-18.8,18.3,18.063a3.893,3.893,0,0,0,1.505.937,1.285,1.285,0,0,0-.167.635v34.521H91.459a1.288,1.288,0,0,0,0,2.576h3.981a1.285,1.285,0,0,0,1.271-1.271V997.619a1.284,1.284,0,0,0-.134-.6,3.939,3.939,0,0,0,2.074-1.438l.033.033.033-.066.066-.1.033-.033.033-.033a4.958,4.958,0,0,0-.569-6.356L77.609,968.585a3.9,3.9,0,0,0-2.944-1.1v-.033c-.072-.011-.235.012-.334,0a2.23,2.23,0,0,0-.669,0c-.024,0-.043.03-.066.033a1.29,1.29,0,0,0-.4-.1l-27.128-.1Zm27.964,2.709a2.955,2.955,0,0,1,.3.033H74.7a1.231,1.231,0,0,1,1.1.4l20.672,20.438a2.591,2.591,0,0,1,.3,2.977c-.013.019-.02.048-.033.066l-.066.1h-.033v.033a1.189,1.189,0,0,1-2.04.2l-19.2-19-.9-.9-.9.9-19.9,19.736a1.324,1.324,0,0,1-1.07.435,1.3,1.3,0,0,1-.937-.636h-.033l-.033-.033-.066-.1c-.011-.011.011-.025,0-.033l-.033-.033a2.592,2.592,0,0,1,.3-2.977l21.408-21.174a1.446,1.446,0,0,1,.8-.435Zm-66.3,35.624a1.285,1.285,0,0,0-1.07,1.271L6.4,1031a1.285,1.285,0,0,0,1.3,1.3s12.428-.261,19.8.234l.066.033c-.175.021.148.021.5.2.425.216,1.02.579,1.706,1,1.372.849,3.121,2.027,4.951,3.211s3.716,2.379,5.419,3.312a10.953,10.953,0,0,0,4.516,1.706h.066c11.616.033,35.111.367,35.156.368h.033a7.183,7.183,0,0,0,7.292-6.757,7,7,0,0,0-1.472-4.984,7.591,7.591,0,0,0-5.452-2.609c-.033-.012-.067-.023-.1-.033l-19-.234a5.075,5.075,0,0,0,.033-1.037,7.611,7.611,0,0,0-3.312-4.583h-.033c-1.655-1.128-6.283-4.582-10.938-7.995s-9.305-6.787-11.306-8.028a1.284,1.284,0,0,0-.635-.167l-27.028-.335a1.294,1.294,0,0,0-.234,0Zm1.505,2.542,25.288.335c1.807,1.141,6.32,4.391,10.871,7.727,4.649,3.408,9.233,6.8,11.038,8.028a4.927,4.927,0,0,1,2.241,2.977,2.768,2.768,0,0,1-.569,2.308,3.215,3.215,0,0,1-4.884.268c-.032-.024-.066-.046-.1-.066l-15.789-11.206a1.285,1.285,0,0,0-1.472,2.108l15.788,11.206.033-.033a5.944,5.944,0,0,0,8.463-.7,5.555,5.555,0,0,0,.368-.77l19.568.234h.066a4.873,4.873,0,0,1,3.579,1.706,4.4,4.4,0,0,1,.937,3.144,4.517,4.517,0,0,1-4.716,4.415s-23.509-.368-35.19-.4h-.033a13.209,13.209,0,0,1-3.345-1.4c-1.593-.872-3.44-2.038-5.252-3.211s-3.586-2.324-5.018-3.211c-.716-.443-1.362-.827-1.907-1.1a3.019,3.019,0,0,0-1.505-.435V1030h-.2c-6.935-.45-16.652-.3-18.565-.268l.3-21.575Z" transform="translate(-6.396 -967.28)" fill="#fff"/>
    <path id="Path_3611" data-name="Path 3611" d="M8.884-2.394h-3.7a4.011,4.011,0,0,0,.909,2.7A3.183,3.183,0,0,0,8.52,1.2,6.448,6.448,0,0,0,10.65.857l.291,2.119a10.93,10.93,0,0,1-2.577.3,5.726,5.726,0,0,1-4.187-1.5,5.848,5.848,0,0,1-1.61-4.177H.78V-3.859H2.567v-1.33H.78V-6.654h1.8a5.821,5.821,0,0,1,1.693-4.119,5.853,5.853,0,0,1,4.187-1.47,11.055,11.055,0,0,1,2.483.322l-.291,2.13a6.637,6.637,0,0,0-2.109-.353,3.152,3.152,0,0,0-2.41.893,3.986,3.986,0,0,0-.935,2.6H8.884v1.465h-3.7v1.33h3.7Z" transform="translate(61.526 44.481)" fill="#fff"/>
  </g>
</svg>
