{
  "images" : [
    {
      "filename" : "icons8-phone_amle.png",
      "idiom" : "universal",
      "scale" : "1x"
    },
    {
      "filename" : "icons8-phone_amle@2x.png",
      "idiom" : "universal",
      "scale" : "2x"
    },
    {
      "filename" : "icons8-phone_amle@3x.png",
      "idiom" : "universal",
      "scale" : "3x"
    }
  ],
  "info" : {
    "author" : "xcode",
    "version" : 1
  }
}
