{
  "images" : [
    {
      "filename" : "man-standing-beside-clear-glass-window-1760901.png",
      "idiom" : "universal",
      "scale" : "1x"
    },
    {
      "filename" : "man-standing-beside-clear-glass-window-1760901@2x.png",
      "idiom" : "universal",
      "scale" : "2x"
    },
    {
      "filename" : "man-standing-beside-clear-glass-window-1760901@3x.png",
      "idiom" : "universal",
      "scale" : "3x"
    }
  ],
  "info" : {
    "author" : "xcode",
    "version" : 1
  }
}
