{
  "project_info": {
    "project_number": "496825949171",
    "project_id": "testing-b6e7f",
    "storage_bucket": "testing-b6e7f.appspot.com"
  },
  "client": [
    {
      "client_info": {
        "mobilesdk_app_id": "1:496825949171:android:557ddc9569df4d93929086",
        "android_client_info": {
          "package_name": "com.example.flyyplugin_example"
        }
      },
      "oauth_client": [
        {
          "client_id": "496825949171-k3o82g2a2f7k4r6r4s90vceonp228v4o.apps.googleusercontent.com",
          "client_type": 1,
          "android_info": {
            "package_name": "com.example.flyyplugin_example",
            "certificate_hash": "c28fd7431de14a173194808e98cccdfc603eb8a0"
          }
        },
        {
          "client_id": "496825949171-7d8cr0op7c451cqq9udsi69dkankvtbc.apps.googleusercontent.com",
          "client_type": 3
        }
      ],
      "api_key": [
        {
          "current_key": "AIzaSyCk5aCGdo1J1CyY92WGUYaQkAx0fwjFkTo"
        }
      ],
      "services": {
        "appinvite_service": {
          "other_platform_oauth_client": [
            {
              "client_id": "496825949171-7d8cr0op7c451cqq9udsi69dkankvtbc.apps.googleusercontent.com",
              "client_type": 3
            }
          ]
        }
      }
    }
  ],
  "configuration_version": "1"
}