{
  "name": "Cisco IOS XR Upgrade Async Install Op",
  "tasks": {
    "2057": {
      "name": "ViewData",
      "summary": "Failed install operation",
      "description": "View data in a pretty format",
      "location": "Application",
      "app": "WorkFlowEngine",
      "displayName": "Tools",
      "type": "manual",
      "variables": {
        "incoming": {
          "header": "ATTENTION",
          "message": "Install operation failed to complete within limit. See logs:",
          "body": "$var.job.inProgress",
          "btn_success": "Ok",
          "btn_failure": ""
        },
        "outgoing": {},
        "error": ""
      },
      "view": "/workflow_engine/task/ViewData",
      "deprecated": false,
      "matched": [
        {
          "key": "name",
          "highlightString": "<span class='highlight-string'>ViewData</span>"
        }
      ],
      "groups": [],
      "x": 1.0471014492753623,
      "y": -0.3653295128939828,
      "scheduled": false
    },
    "workflow_start": {
      "name": "workflow_start",
      "groups": [],
      "x": -0.0927536231884058,
      "y": 0.5200573065902578,
      "summary": "workflow_start",
      "description": "workflow_start"
    },
    "workflow_end": {
      "name": "workflow_end",
      "groups": [],
      "x": 1.3094202898550724,
      "y": 0.7349570200573066,
      "summary": "workflow_end",
      "description": "workflow_end"
    },
    "6a3": {
      "name": "query",
      "summary": "Query Response",
      "description": "Query data using a dot/bracket notation string and a matching key/value pair.",
      "location": "Application",
      "locationType": null,
      "app": "WorkFlowEngine",
      "displayName": "WorkFlowEngine",
      "type": "operation",
      "variables": {
        "incoming": {
          "pass_on_null": false,
          "query": "commands_results[0].response",
          "obj": "$var.job.mop_template_results"
        },
        "outgoing": {
          "return_data": null
        },
        "error": ""
      },
      "deprecated": false,
      "matched": [
        {
          "key": "name",
          "highlightString": "<span class='highlight-string'>query</span>"
        },
        {
          "key": "summary",
          "highlightString": "<span class='highlight-string'>Query</span> Data Using 'json-query' Format"
        },
        {
          "key": "description",
          "highlightString": "<span class='highlight-string'>Query</span> data using a dot/bracket notation string and a matching key/value pair."
        }
      ],
      "groups": [],
      "x": -0.010144927536231883,
      "y": 0.5186246418338109,
      "scheduled": false
    },
    "12be": {
      "name": "match",
      "summary": "Match operation id",
      "description": "Retrieves the matches when matching a string against a regular expression.",
      "location": "Application",
      "locationType": null,
      "app": "WorkFlowEngine",
      "displayName": "String",
      "type": "automatic",
      "variables": {
        "incoming": {
          "str": "$var.6a3.return_data",
          "regExp": "/operation (\\d+) started/",
          "flags": ""
        },
        "outgoing": {
          "matches": null
        },
        "error": ""
      },
      "deprecated": false,
      "matched": [],
      "groups": [],
      "actor": "Pronghorn",
      "x": 0.2536231884057971,
      "y": 0.5157593123209169,
      "scheduled": false
    },
    "c231": {
      "name": "query",
      "summary": "Query operation number",
      "description": "Query first capture group (\\d+)",
      "location": "Application",
      "locationType": null,
      "app": "WorkFlowEngine",
      "displayName": "WorkFlowEngine",
      "type": "operation",
      "variables": {
        "incoming": {
          "pass_on_null": false,
          "query": "[1]",
          "obj": "$var.12be.matches"
        },
        "outgoing": {
          "return_data": "$var.job.operation_id"
        },
        "error": ""
      },
      "deprecated": false,
      "matched": [
        {
          "key": "name",
          "highlightString": "<span class='highlight-string'>query</span>"
        },
        {
          "key": "summary",
          "highlightString": "<span class='highlight-string'>Query</span> Data Using 'json-query' Format"
        },
        {
          "key": "description",
          "highlightString": "<span class='highlight-string'>Query</span> data using a dot/bracket notation string and a matching key/value pair."
        }
      ],
      "groups": [],
      "x": 0.38913043478260867,
      "y": 0.5186246418338109,
      "scheduled": false
    },
    "39fb": {
      "name": "RunCommand",
      "summary": "Run a Command against a Device",
      "description": "Run a command against a device.",
      "location": "Application",
      "locationType": null,
      "app": "MOP",
      "displayName": "Command Templates",
      "type": "automatic",
      "variables": {
        "incoming": {
          "command": "show install request",
          "variables": "",
          "device": "$var.job.device"
        },
        "outgoing": {
          "result": null
        },
        "error": ""
      },
      "deprecated": false,
      "matched": [
        {
          "key": "name",
          "highlightString": "Run<span class='highlight-string'>Command</span>"
        },
        {
          "key": "summary",
          "highlightString": "Run a <span class='highlight-string'>Command</span> against a Device"
        },
        {
          "key": "description",
          "highlightString": "Run a <span class='highlight-string'>command</span> against a device."
        }
      ],
      "groups": [],
      "actor": "Pronghorn",
      "x": 0.8132678132678133,
      "y": 0.5214899713467048,
      "scheduled": false
    },
    "899f": {
      "name": "evaluation",
      "summary": "Run Evaluation Task",
      "description": "Run an evaluation",
      "location": "Application",
      "locationType": null,
      "app": "WorkFlowEngine",
      "displayName": "WorkFlowEngine",
      "type": "operation",
      "variables": {
        "incoming": {
          "all_true_flag": false,
          "evaluation_groups": [
            {
              "all_true_flag": false,
              "evaluations": [
                {
                  "query": "response",
                  "operand_1": {
                    "variable": "result",
                    "task": "39fb"
                  },
                  "operator": "contains",
                  "operand_2": {
                    "variable": "No install operation in progress",
                    "task": "static"
                  }
                }
              ]
            }
          ]
        },
        "outgoing": {
          "return_value": null
        }
      },
      "deprecated": false,
      "matched": [
        {
          "key": "name",
          "highlightString": "<span class='highlight-string'>eval</span>uation"
        },
        {
          "key": "summary",
          "highlightString": "Run <span class='highlight-string'>Eval</span>uation Task"
        },
        {
          "key": "description",
          "highlightString": "Run an <span class='highlight-string'>eval</span>uation"
        }
      ],
      "groups": [],
      "x": 0.8095823095823096,
      "y": 0.2664756446991404
    },
    "a3b": {
      "name": "delay",
      "summary": "Delay a Job",
      "description": "Delay a Job for a duration by Job ID and number of seconds.",
      "location": "Application",
      "locationType": null,
      "app": "WorkFlowEngine",
      "displayName": "WorkFlowEngine",
      "type": "operation",
      "variables": {
        "incoming": {
          "time": 30
        },
        "outgoing": {
          "time_in_milliseconds": null
        },
        "error": ""
      },
      "deprecated": false,
      "matched": [],
      "groups": [],
      "x": 0.6695652173913044,
      "y": -0.36103151862464183,
      "scheduled": false
    },
    "e3ee": {
      "name": "evaluation",
      "summary": "Run Evaluation Task",
      "description": "Run an evaluation",
      "location": "Application",
      "locationType": null,
      "app": "WorkFlowEngine",
      "displayName": "WorkFlowEngine",
      "type": "operation",
      "variables": {
        "incoming": {
          "all_true_flag": false,
          "evaluation_groups": [
            {
              "all_true_flag": false,
              "evaluations": [
                {
                  "query": "result",
                  "operand_1": {
                    "variable": "mop_template_results",
                    "task": "job",
                    "editable": false
                  },
                  "operator": "==",
                  "operand_2": {
                    "variable": true,
                    "task": "static"
                  }
                }
              ]
            }
          ]
        },
        "outgoing": {
          "return_value": null
        }
      },
      "deprecated": false,
      "matched": [
        {
          "key": "name",
          "highlightString": "<span class='highlight-string'>eval</span>uation"
        },
        {
          "key": "summary",
          "highlightString": "Run <span class='highlight-string'>Eval</span>uation Task"
        },
        {
          "key": "description",
          "highlightString": "Run an <span class='highlight-string'>eval</span>uation"
        }
      ],
      "groups": [],
      "x": 0.06956521739130435,
      "y": 0.5186246418338109
    },
    "3fba": {
      "name": "ViewData",
      "summary": "Command Failed",
      "description": "View data in a pretty format",
      "location": "Application",
      "app": "WorkFlowEngine",
      "displayName": "Tools",
      "type": "manual",
      "variables": {
        "incoming": {
          "header": "ATTENTION",
          "message": "Command Failed:",
          "body": "$var.job.mop_template_results",
          "btn_success": "Ok",
          "btn_failure": ""
        },
        "outgoing": {},
        "error": ""
      },
      "view": "/workflow_engine/task/ViewData",
      "deprecated": false,
      "matched": [
        {
          "key": "name",
          "highlightString": "<span class='highlight-string'>ViewData</span>"
        }
      ],
      "groups": [],
      "x": 0.20869565217391303,
      "y": 0.9512893982808023,
      "scheduled": false
    },
    "1a4d": {
      "name": "newVariable",
      "summary": "Create a Job Variable",
      "description": "Create a new Job variable by Job ID and assign it a value.",
      "location": "Application",
      "locationType": null,
      "app": "WorkFlowEngine",
      "displayName": "WorkFlowEngine",
      "type": "operation",
      "variables": {
        "incoming": {
          "name": "response",
          "value": "success"
        },
        "outgoing": {
          "value": null
        }
      },
      "deprecated": false,
      "matched": [
        {
          "key": "name",
          "highlightString": "<span class='highlight-string'>new</span>Variable"
        },
        {
          "key": "description",
          "highlightString": "Create a <span class='highlight-string'>new</span> Job variable by Job ID and assign it a value."
        }
      ],
      "groups": [],
      "x": 1.0601449275362318,
      "y": 0.504297994269341
    },
    "de3e": {
      "name": "newVariable",
      "summary": "Create a Job Variable",
      "description": "Create a new Job variable by Job ID and assign it a value.",
      "location": "Application",
      "locationType": null,
      "app": "WorkFlowEngine",
      "displayName": "WorkFlowEngine",
      "type": "operation",
      "variables": {
        "incoming": {
          "name": "response",
          "value": "failure"
        },
        "outgoing": {
          "value": null
        }
      },
      "deprecated": false,
      "matched": [
        {
          "key": "name",
          "highlightString": "<span class='highlight-string'>new</span>Variable"
        },
        {
          "key": "description",
          "highlightString": "Create a <span class='highlight-string'>new</span> Job variable by Job ID and assign it a value."
        }
      ],
      "groups": [],
      "x": 1.0594202898550724,
      "y": 0.7378223495702005
    },
    "57af": {
      "name": "evaluation",
      "summary": "Eval verbose mode",
      "description": "Run an evaluation",
      "location": "Application",
      "locationType": null,
      "app": "WorkFlowEngine",
      "displayName": "WorkFlowEngine",
      "type": "operation",
      "variables": {
        "incoming": {
          "all_true_flag": false,
          "evaluation_groups": [
            {
              "all_true_flag": false,
              "evaluations": [
                {
                  "query": "",
                  "operand_1": {
                    "variable": "mode",
                    "task": "job",
                    "editable": true
                  },
                  "operator": "==",
                  "operand_2": {
                    "variable": "Verbose",
                    "task": "static"
                  }
                }
              ]
            }
          ]
        },
        "outgoing": {
          "return_value": null
        }
      },
      "deprecated": false,
      "matched": [
        {
          "key": "name",
          "highlightString": "<span class='highlight-string'>eval</span>uation"
        },
        {
          "key": "summary",
          "highlightString": "Run <span class='highlight-string'>Eval</span>uation Task"
        },
        {
          "key": "description",
          "highlightString": "Run an <span class='highlight-string'>eval</span>uation"
        }
      ],
      "groups": [],
      "x": 0.06956521739130435,
      "y": 0.7392550143266475
    },
    "dd95": {
      "name": "match",
      "summary": "Find operation id",
      "description": "Retrieves the matches when matching a string against a regular expression.",
      "location": "Application",
      "locationType": null,
      "app": "WorkFlowEngine",
      "displayName": "String",
      "type": "automatic",
      "variables": {
        "incoming": {
          "str": "$var.6a3.return_data",
          "regExp": "/\\d+/",
          "flags": ""
        },
        "outgoing": {
          "matches": null
        },
        "error": ""
      },
      "deprecated": false,
      "matched": [
        {
          "key": "app",
          "highlightString": "<span class='highlight-string'>String</span>Methods"
        },
        {
          "key": "summary",
          "highlightString": "Finds regex matches in a <span class='highlight-string'>string</span>."
        },
        {
          "key": "description",
          "highlightString": "Retrieves the matches when matching a <span class='highlight-string'>string</span> against a regular expression."
        }
      ],
      "groups": [],
      "actor": "Pronghorn",
      "x": 0.5,
      "y": 0.7392550143266475,
      "scheduled": false
    },
    "d53d": {
      "name": "query",
      "summary": "Query operation number",
      "description": "Query data using a dot/bracket notation string and a matching key/value pair.",
      "location": "Application",
      "locationType": null,
      "app": "WorkFlowEngine",
      "displayName": "WorkFlowEngine",
      "type": "operation",
      "variables": {
        "incoming": {
          "pass_on_null": false,
          "query": "[0]",
          "obj": "$var.dd95.matches"
        },
        "outgoing": {
          "return_data": "$var.job.operation_id"
        },
        "error": ""
      },
      "deprecated": false,
      "matched": [
        {
          "key": "name",
          "highlightString": "<span class='highlight-string'>query</span>"
        },
        {
          "key": "summary",
          "highlightString": "<span class='highlight-string'>Query</span> Data Using 'json-query' Format"
        },
        {
          "key": "description",
          "highlightString": "<span class='highlight-string'>Query</span> data using a dot/bracket notation string and a matching key/value pair."
        }
      ],
      "groups": [],
      "x": 0.5739130434782609,
      "y": 0.7349570200573066,
      "scheduled": false
    },
    "fc81": {
      "name": "newVariable",
      "summary": "Create a Job Variable",
      "description": "Create a new Job variable by Job ID and assign it a value.",
      "location": "Application",
      "locationType": null,
      "app": "WorkFlowEngine",
      "displayName": "WorkFlowEngine",
      "type": "operation",
      "variables": {
        "incoming": {
          "name": "inProgress",
          "value": []
        },
        "outgoing": {
          "value": null
        }
      },
      "deprecated": false,
      "matched": [
        {
          "key": "name",
          "highlightString": "<span class='highlight-string'>new</span>Variable"
        },
        {
          "key": "description",
          "highlightString": "Create a <span class='highlight-string'>new</span> Job variable by Job ID and assign it a value."
        }
      ],
      "groups": [],
      "x": 0.5565217391304348,
      "y": 0.5214899713467048
    },
    "cb49": {
      "name": "push",
      "summary": "Push Item to Array",
      "description": "Push item to a job variable array",
      "location": "Application",
      "locationType": null,
      "app": "WorkFlowEngine",
      "displayName": "WorkFlowEngine",
      "type": "operation",
      "variables": {
        "incoming": {
          "job_variable": "inProgress",
          "item_to_push": "$var.1b6e.return_data"
        },
        "outgoing": {
          "job_variable_value": null
        }
      },
      "deprecated": false,
      "matched": [
        {
          "key": "name",
          "highlightString": "<span class='highlight-string'>push</span>"
        },
        {
          "key": "summary",
          "highlightString": "<span class='highlight-string'>Push</span> Item to Array"
        },
        {
          "key": "description",
          "highlightString": "<span class='highlight-string'>Push</span> item to a job variable array"
        }
      ],
      "groups": [],
      "x": 0.8115942028985508,
      "y": -0.0071633237822349575
    },
    "1b6e": {
      "name": "query",
      "summary": "Query command response",
      "description": "Query data using a dot/bracket notation string and a matching key/value pair.",
      "location": "Application",
      "locationType": null,
      "app": "WorkFlowEngine",
      "displayName": "WorkFlowEngine",
      "type": "operation",
      "variables": {
        "incoming": {
          "pass_on_null": false,
          "query": "response",
          "obj": "$var.39fb.result"
        },
        "outgoing": {
          "return_data": null
        },
        "error": ""
      },
      "deprecated": false,
      "matched": [
        {
          "key": "name",
          "highlightString": "<span class='highlight-string'>query</span>"
        },
        {
          "key": "summary",
          "highlightString": "<span class='highlight-string'>Query</span> Data Using 'json-query' Format"
        },
        {
          "key": "description",
          "highlightString": "<span class='highlight-string'>Query</span> data using a dot/bracket notation string and a matching key/value pair."
        }
      ],
      "groups": [],
      "x": 0.8108695652173913,
      "y": 0.14613180515759314,
      "scheduled": false
    },
    "3e39": {
      "name": "arrayLength",
      "summary": "length",
      "description": "Returns the number of elements in that array. The value is an unsigned, 32-bit integer  that is always numerically greater than the highest index in the array.",
      "location": "Application",
      "locationType": null,
      "app": "WorkFlowEngine",
      "displayName": "Array",
      "type": "automatic",
      "variables": {
        "incoming": {
          "arr": "$var.job.inProgress"
        },
        "outgoing": {
          "length": null
        },
        "error": ""
      },
      "deprecated": false,
      "matched": [
        {
          "key": "name",
          "highlightString": "<span class='highlight-string'>length</span>"
        },
        {
          "key": "summary",
          "highlightString": "Gets the <span class='highlight-string'>length</span> of an array."
        }
      ],
      "groups": [],
      "actor": "Pronghorn",
      "x": 0.8115942028985508,
      "y": -0.19627507163323782,
      "scheduled": false,
      "canvasName": "length"
    },
    "f603": {
      "name": "evaluation",
      "summary": "Eval array length",
      "description": "Run an evaluation",
      "location": "Application",
      "locationType": null,
      "app": "WorkFlowEngine",
      "displayName": "WorkFlowEngine",
      "type": "operation",
      "variables": {
        "incoming": {
          "all_true_flag": false,
          "evaluation_groups": [
            {
              "all_true_flag": false,
              "evaluations": [
                {
                  "query": "",
                  "operand_1": {
                    "variable": "length",
                    "task": "3e39"
                  },
                  "operator": ">",
                  "operand_2": {
                    "variable": 20,
                    "task": "static"
                  }
                }
              ]
            }
          ]
        },
        "outgoing": {
          "return_value": null
        }
      },
      "deprecated": false,
      "matched": [
        {
          "key": "name",
          "highlightString": "<span class='highlight-string'>eval</span>uation"
        },
        {
          "key": "summary",
          "highlightString": "Run <span class='highlight-string'>Eval</span>uation Task"
        },
        {
          "key": "description",
          "highlightString": "Run an <span class='highlight-string'>eval</span>uation"
        }
      ],
      "groups": [],
      "x": 0.8101449275362319,
      "y": -0.3653295128939828
    },
    "63a0": {
      "name": "evaluation",
      "summary": "Eval verbose mode",
      "description": "Run an evaluation",
      "location": "Application",
      "locationType": null,
      "app": "WorkFlowEngine",
      "displayName": "WorkFlowEngine",
      "type": "operation",
      "variables": {
        "incoming": {
          "all_true_flag": false,
          "evaluation_groups": [
            {
              "all_true_flag": false,
              "evaluations": [
                {
                  "query": "",
                  "operand_1": {
                    "variable": "mode",
                    "task": "job",
                    "editable": true
                  },
                  "operator": "==",
                  "operand_2": {
                    "variable": "Verbose",
                    "task": "static"
                  }
                }
              ]
            }
          ]
        },
        "outgoing": {
          "return_value": null
        }
      },
      "deprecated": false,
      "matched": [
        {
          "key": "name",
          "highlightString": "<span class='highlight-string'>eval</span>uation"
        },
        {
          "key": "summary",
          "highlightString": "Run <span class='highlight-string'>Eval</span>uation Task"
        },
        {
          "key": "description",
          "highlightString": "Run an <span class='highlight-string'>eval</span>uation"
        }
      ],
      "groups": [],
      "x": 0.9,
      "y": -0.3638968481375358
    },
    "6db2": {
      "name": "newVariable",
      "summary": "Create a Job Variable",
      "description": "Create a new Job variable by Job ID and assign it a value.",
      "location": "Application",
      "locationType": null,
      "app": "WorkFlowEngine",
      "displayName": "WorkFlowEngine",
      "type": "operation",
      "variables": {
        "incoming": {
          "name": "response",
          "value": "failure"
        },
        "outgoing": {
          "value": null
        }
      },
      "deprecated": false,
      "matched": [
        {
          "key": "name",
          "highlightString": "<span class='highlight-string'>new</span>Variable"
        },
        {
          "key": "description",
          "highlightString": "Create a <span class='highlight-string'>new</span> Job variable by Job ID and assign it a value."
        }
      ],
      "groups": [],
      "x": 1.0514492753623188,
      "y": 0.034383954154727794
    },
    "db33": {
      "name": "stringIncludes",
      "summary": "Includes op ID",
      "description": "Determines whether one string can be found within another string, returning true or false",
      "location": "Application",
      "locationType": null,
      "app": "WorkFlowEngine",
      "displayName": "String",
      "type": "automatic",
      "variables": {
        "incoming": {
          "str": "$var.6a3.return_data",
          "searchString": "operation id",
          "position": ""
        },
        "outgoing": {
          "result": null
        },
        "error": ""
      },
      "deprecated": false,
      "matched": [
        {
          "key": "name",
          "highlightString": "<span class='highlight-string'>inclu</span>des"
        },
        {
          "key": "summary",
          "highlightString": "Finds whether one string is <span class='highlight-string'>inclu</span>ded within another."
        }
      ],
      "groups": [],
      "actor": "Pronghorn",
      "x": 0.35289855072463766,
      "y": 0.7378223495702005,
      "scheduled": false,
      "canvasName": "includes"
    },
    "d7f9": {
      "name": "RunCommand",
      "summary": "Show install log",
      "description": "Run a command against a device.",
      "location": "Application",
      "locationType": null,
      "app": "MOP",
      "displayName": "Command Templates",
      "type": "automatic",
      "variables": {
        "incoming": {
          "command": "show install log <!id!> detail",
          "variables": "$var.a876.merged_object",
          "device": "$var.job.device"
        },
        "outgoing": {
          "result": null
        },
        "error": ""
      },
      "deprecated": false,
      "matched": [
        {
          "key": "name",
          "highlightString": "<span class='highlight-string'>RunComman</span>d"
        }
      ],
      "groups": [],
      "actor": "Pronghorn",
      "x": 0.7115942028985507,
      "y": 0.7406876790830945,
      "scheduled": false
    },
    "a876": {
      "name": "merge",
      "summary": "Create failed op id",
      "description": "Merge data into a single object",
      "location": "Application",
      "locationType": null,
      "app": "WorkFlowEngine",
      "displayName": "WorkFlowEngine",
      "type": "operation",
      "variables": {
        "incoming": {
          "data_to_merge": [
            {
              "key": "id",
              "value": {
                "task": "d53d",
                "variable": "return_data"
              }
            }
          ]
        },
        "outgoing": {
          "merged_object": null
        }
      },
      "deprecated": false,
      "matched": [
        {
          "key": "name",
          "highlightString": "<span class='highlight-string'>merge</span>"
        },
        {
          "key": "summary",
          "highlightString": "<span class='highlight-string'>Merge</span> Data"
        },
        {
          "key": "description",
          "highlightString": "<span class='highlight-string'>Merge</span> data into a single object"
        }
      ],
      "groups": [],
      "x": 0.6340579710144928,
      "y": 0.7406876790830945
    },
    "e82b": {
      "name": "makeData",
      "summary": "Make Data",
      "description": "Make Data",
      "location": "Application",
      "locationType": null,
      "app": "WorkFlowEngine",
      "displayName": "Tools",
      "type": "automatic",
      "variables": {
        "incoming": {
          "input": "<!response!>",
          "outputType": "string",
          "variables": "$var.d7f9.result"
        },
        "outgoing": {
          "output": null
        },
        "error": ""
      },
      "deprecated": false,
      "matched": [
        {
          "key": "name",
          "highlightString": "<span class='highlight-string'>makeData</span>"
        }
      ],
      "groups": [],
      "actor": "Pronghorn",
      "x": 0.8050724637681159,
      "y": 0.7392550143266475,
      "scheduled": false
    },
    "b031": {
      "name": "ViewData",
      "summary": "Show log",
      "description": "View data in a pretty format",
      "location": "Application",
      "app": "WorkFlowEngine",
      "displayName": "Tools",
      "type": "manual",
      "variables": {
        "incoming": {
          "header": "ATTENTION",
          "message": "Action required. See log:",
          "body": "$var.e82b.output",
          "btn_success": "Ok",
          "btn_failure": ""
        },
        "outgoing": {},
        "error": ""
      },
      "view": "/workflow_engine/task/ViewData",
      "deprecated": false,
      "matched": [
        {
          "key": "name",
          "highlightString": "<span class='highlight-string'>ViewData</span>"
        }
      ],
      "groups": [],
      "x": 0.9181159420289855,
      "y": 0.7392550143266475,
      "scheduled": false
    },
    "891d": {
      "name": "ViewData",
      "summary": "Command failed",
      "description": "View data in a pretty format",
      "location": "Application",
      "app": "WorkFlowEngine",
      "displayName": "Tools",
      "type": "manual",
      "variables": {
        "incoming": {
          "header": "ATTENTION",
          "message": "Action required:",
          "body": "$var.6a3.return_data",
          "btn_success": "Ok",
          "btn_failure": ""
        },
        "outgoing": {},
        "error": ""
      },
      "view": "/workflow_engine/task/ViewData",
      "deprecated": false,
      "matched": [
        {
          "key": "name",
          "highlightString": "<span class='highlight-string'>ViewData</span>"
        }
      ],
      "groups": [],
      "x": 0.4282608695652174,
      "y": 0.9512893982808023,
      "scheduled": false
    },
    "afd4": {
      "name": "evaluation",
      "summary": "Run Evaluation Task",
      "description": "Run an evaluation",
      "location": "Application",
      "locationType": null,
      "app": "WorkFlowEngine",
      "displayName": "WorkFlowEngine",
      "type": "operation",
      "variables": {
        "incoming": {
          "all_true_flag": false,
          "evaluation_groups": [
            {
              "all_true_flag": false,
              "evaluations": [
                {
                  "query": "",
                  "operand_1": {
                    "variable": "result",
                    "task": "db33"
                  },
                  "operator": "==",
                  "operand_2": {
                    "variable": true,
                    "task": "static"
                  }
                }
              ]
            }
          ]
        },
        "outgoing": {
          "return_value": null
        }
      },
      "deprecated": false,
      "matched": [
        {
          "key": "name",
          "highlightString": "<span class='highlight-string'>eval</span>uation"
        },
        {
          "key": "summary",
          "highlightString": "Run <span class='highlight-string'>Eval</span>uation Task"
        },
        {
          "key": "description",
          "highlightString": "Run an <span class='highlight-string'>eval</span>uation"
        }
      ],
      "groups": [],
      "x": 0.42391304347826086,
      "y": 0.7335243553008596
    }
  },
  "transitions": {
    "2057": {
      "6db2": {
        "type": "standard",
        "state": "success"
      }
    },
    "workflow_start": {
      "6a3": {
        "type": "standard",
        "state": "success"
      }
    },
    "workflow_end": {},
    "6a3": {
      "e3ee": {
        "type": "standard",
        "state": "success"
      }
    },
    "12be": {
      "c231": {
        "type": "standard",
        "state": "success"
      }
    },
    "dcf9": {},
    "c231": {
      "fc81": {
        "type": "standard",
        "state": "success"
      }
    },
    "4fc5": {},
    "39fb": {
      "899f": {
        "type": "standard",
        "state": "success"
      }
    },
    "899f": {
      "1a4d": {
        "type": "standard",
        "state": "success"
      },
      "1b6e": {
        "type": "standard",
        "state": "failure"
      }
    },
    "a3b": {
      "39fb": {
        "type": "revert",
        "state": "success"
      }
    },
    "e3ee": {
      "57af": {
        "type": "standard",
        "state": "failure"
      },
      "12be": {
        "type": "standard",
        "state": "success"
      }
    },
    "3fba": {
      "db33": {
        "type": "standard",
        "state": "success"
      }
    },
    "1a4d": {
      "workflow_end": {
        "type": "standard",
        "state": "success"
      }
    },
    "de3e": {
      "workflow_end": {
        "type": "standard",
        "state": "success"
      }
    },
    "57af": {
      "3fba": {
        "type": "standard",
        "state": "success"
      },
      "db33": {
        "type": "standard",
        "state": "failure"
      }
    },
    "dd95": {
      "d53d": {
        "type": "standard",
        "state": "success"
      }
    },
    "d53d": {
      "a876": {
        "type": "standard",
        "state": "success"
      }
    },
    "fc81": {
      "39fb": {
        "type": "standard",
        "state": "success"
      }
    },
    "cb49": {
      "3e39": {
        "type": "standard",
        "state": "success"
      }
    },
    "1b6e": {
      "cb49": {
        "type": "standard",
        "state": "success"
      }
    },
    "3e39": {
      "f603": {
        "type": "standard",
        "state": "success"
      }
    },
    "f603": {
      "a3b": {
        "type": "standard",
        "state": "failure"
      },
      "63a0": {
        "type": "standard",
        "state": "success"
      }
    },
    "63a0": {
      "2057": {
        "type": "standard",
        "state": "success"
      },
      "6db2": {
        "type": "standard",
        "state": "failure"
      }
    },
    "6db2": {
      "workflow_end": {
        "type": "standard",
        "state": "success"
      }
    },
    "db33": {
      "afd4": {
        "type": "standard",
        "state": "success"
      }
    },
    "d7f9": {
      "e82b": {
        "type": "standard",
        "state": "success"
      }
    },
    "a876": {
      "d7f9": {
        "type": "standard",
        "state": "success"
      }
    },
    "e82b": {
      "b031": {
        "type": "standard",
        "state": "success"
      }
    },
    "b031": {
      "de3e": {
        "type": "standard",
        "state": "success"
      }
    },
    "891d": {
      "de3e": {
        "type": "standard",
        "state": "success"
      }
    },
    "afd4": {
      "dd95": {
        "type": "standard",
        "state": "success"
      },
      "891d": {
        "type": "standard",
        "state": "failure"
      }
    }
  },
  "font_size": 12,
  "created": "2020-01-15T15:11:49.529Z",
  "created_by": {
    "provenance": "Local AAA",
    "username": "admin@pronghorn",
    "firstname": "admin",
    "inactive": true,
    "email": ""
  },
  "createdVersion": "4.5.3-2019.2.9.0",
  "last_updated": "2021-02-22T16:06:22.186Z",
  "last_updated_by": {
    "provenance": "local_aaa",
    "username": "admin@pronghorn",
    "firstname": "admin",
    "inactive": false,
    "email": "rahul.chakraborty@itential.com"
  },
  "lastUpdatedVersion": "5.29.14-2020.2.9",
  "type": "automation",
  "description": null,
  "inputSchema": {
    "type": "object",
    "properties": {
      "mop_template_results": {
        "anyOf": [
          {
            "type": "object",
            "examples": [
              {
                "name": "value"
              }
            ]
          },
          {
            "type": "string"
          }
        ]
      },
      "device": {
        "type": [
          "array",
          "boolean",
          "null",
          "number",
          "object",
          "string"
        ]
      },
      "mode": {
        "type": [
          "array",
          "boolean",
          "null",
          "number",
          "object",
          "string"
        ]
      }
    },
    "required": [
      "mop_template_results",
      "device",
      "mode"
    ]
  },
  "outputSchema": {
    "type": "object",
    "properties": {
      "mop_template_results": {
        "anyOf": [
          {
            "type": "object",
            "examples": [
              {
                "name": "value"
              }
            ]
          },
          {
            "type": "string"
          }
        ]
      },
      "device": {
        "type": [
          "array",
          "boolean",
          "null",
          "number",
          "object",
          "string"
        ]
      },
      "mode": {
        "type": [
          "array",
          "boolean",
          "null",
          "number",
          "object",
          "string"
        ]
      },
      "_id": {
        "type": "string",
        "pattern": "^[0-9a-f]{24}$"
      },
      "initiator": {
        "type": "string"
      },
      "inProgress": {
        "type": [
          "array",
          "boolean",
          "null",
          "number",
          "object",
          "string"
        ]
      },
      "operation_id": {
        "type": [
          "string",
          "number",
          "object",
          "integer",
          "array",
          "boolean",
          "null"
        ],
        "examples": [
          "value"
        ]
      },
      "response": {
        "type": "string"
      }
    }
  },
  "tags": [],
  "groups": []
}
