{
  "_id": "5f6a3fefb7a0a706e5b10588",
  "name": "Cisco IOS XR Upgrade-pie-mode",
  "description": "",
  "incoming": [
    {
      "$id": "formData",
      "title": "Cisco IOS XR Upgrade",
      "description": "Perform an IOS XR upgrade on an Ansible device",
      "type": "object",
      "required": [
        "device",
        "executionMode"
      ],
      "properties": {
        "device": {
          "type": "string",
          "title": "Device",
          "description": "Choose an IOS XR device:"
        },
        "pie": {
          "type": "object",
          "title": "PIE",
          "description": "",
          "required": [
            "location",
            "file"
          ],
          "properties": {
            "location": {
              "type": "string",
              "title": "Location",
              "description": "Location of PIE image, e.g. harddisk:/var"
            },
            "file": {
              "type": "string",
              "title": "File",
              "description": "Image filename"
            }
          }
        },
        "executionMode": {
          "type": "string"
        }
      }
    }
  ],
  "outgoing": [
    {
      "$id": "device",
      "type": "string"
    },
    {
      "$id": "pie.location",
      "type": "string"
    },
    {
      "$id": "pie.file",
      "type": "string"
    },
    {
      "$id": "PIEmetadata",
      "type": "object",
      "properties": {
        "location": {
          "type": "string"
        },
        "file": {
          "type": "string"
        }
      },
      "required": []
    },
    {
      "$id": "mode",
      "type": "string"
    }
  ],
  "steps": [
    {
      "id": 1,
      "type": "assign",
      "from": {
        "location": "incoming",
        "name": "formData",
        "ptr": "/device"
      },
      "to": {
        "location": "outgoing",
        "name": "device",
        "ptr": ""
      }
    },
    {
      "id": 2,
      "type": "assign",
      "from": {
        "location": "incoming",
        "name": "formData",
        "ptr": "/pie/location"
      },
      "to": {
        "location": "outgoing",
        "name": "pie.location",
        "ptr": ""
      }
    },
    {
      "id": 3,
      "type": "assign",
      "from": {
        "location": "incoming",
        "name": "formData",
        "ptr": "/pie/file"
      },
      "to": {
        "location": "outgoing",
        "name": "pie.file",
        "ptr": ""
      }
    },
    {
      "id": 15,
      "type": "assign",
      "from": {
        "location": "incoming",
        "name": "formData",
        "ptr": "/pie/location"
      },
      "to": {
        "location": "outgoing",
        "name": "PIEmetadata",
        "ptr": "/location"
      }
    },
    {
      "id": 16,
      "type": "assign",
      "from": {
        "location": "incoming",
        "name": "formData",
        "ptr": "/pie/file"
      },
      "to": {
        "location": "outgoing",
        "name": "PIEmetadata",
        "ptr": "/file"
      }
    },
    {
      "id": 17,
      "type": "assign",
      "from": {
        "location": "incoming",
        "name": "formData",
        "ptr": "/executionMode"
      },
      "to": {
        "location": "outgoing",
        "name": "mode",
        "ptr": ""
      }
    }
  ],
  "functions": [],
  "view": {
    "col": 3,
    "row": 4
  },
  "created": "2020-09-22T18:18:23.930Z",
  "createdBy": {
    "_id": "5f5142b0a1ff8106e83c1964",
    "provenance": "Itential AAA LDAP",
    "username": "mitch.veazey"
  },
  "lastUpdated": "2020-09-22T18:18:23.930Z",
  "lastUpdatedBy": {
    "_id": "5f5142b0a1ff8106e83c1964",
    "provenance": "Itential AAA LDAP",
    "username": "mitch.veazey"
  }
}

