{
  "id": "5e46993a18462a154a52be7d",
  "created": "2019-12-31T20:11:24.978Z",
  "createdBy": "justin.cotton",
  "lastUpdated": "2020-09-22T15:32:08.568Z",
  "lastUpdatedBy": "mitch.veazey",
  "name": "Cisco IOS XR Upgrade",
  "description": "Perform an IOS XR upgrade on an Ansible device",
  "struct": {
    "type": "object",
    "description": "",
    "items": [
      {
        "nodeId": "e3da95e7-225f-40cf-8cab-ad7fa8694902",
        "type": "string",
        "title": "Device",
        "description": "Choose an IOS XR device:",
        "placeholder": "",
        "required": true,
        "enum": [],
        "binding": true,
        "rel": "collection",
        "targetPointer": "/enum",
        "method": "POST",
        "base": "/",
        "href": "configuration_manager/devices",
        "body": {
          "options": {
            "limit": 20,
            "start": 0,
            "sort": [
              {
                "name": 1,
                "address": 1,
                "port": 1
              }
            ],
            "order": "ascending",
            "adapterType": [
              "AutomationGateway"
            ]
          }
        },
        "sourcePointer": "/list",
        "sourceKeyPointer": "/name"
      },
      {
        "nodeId": "302688b0-9c3c-4b02-8b01-4bbd2a77e51d",
        "type": "boolean",
        "title": "Admin",
        "description": "Run all commands against device in admin mode",
        "default": false
      },
      {
        "nodeId": "120fae60-62ea-4495-b6f1-e89b603762bf",
        "type": "object",
        "description": "",
        "items": [
          {
            "nodeId": "e91eb308-80e8-44e0-96a2-0d836242435d",
            "type": "string",
            "title": "Location",
            "description": "Location of PIE image, e.g. harddisk:/var",
            "placeholder": "",
            "required": true
          },
          {
            "nodeId": "fe36d227-d80b-4778-8d30-478a41ee1140",
            "type": "string",
            "title": "File",
            "description": "Image filename",
            "placeholder": "",
            "required": true
          }
        ],
        "title": "PIE"
      },
      {
        "nodeId": "6ae0bf1d-bbe8-4e20-8c2e-f98861aa4cd0",
        "type": "object",
        "description": "",
        "items": [
          {
            "nodeId": "cd3d5601-e93a-4981-b9a4-df7af21f1988",
            "type": "string",
            "title": "Location",
            "description": "Location of SMU images, e.g. harddisk:/var",
            "placeholder": "",
            "required": false
          },
          {
            "nodeId": "99b99777-7cf4-4653-ab32-d598709b4b0d",
            "type": "array",
            "description": "",
            "items": [
              {
                "nodeId": "4f932cac-93cd-4021-99fb-6674e2e0621f",
                "type": "string",
                "widget": "textarea",
                "title": "File",
                "description": "",
                "placeholder": "",
                "required": false
              }
            ],
            "title": "Files"
          }
        ],
        "title": "SMU"
      },
      {
        "nodeId": "99a0fef1-7357-4b0f-98fa-96e73008e7bd",
        "type": "string",
        "title": "Execution Mode",
        "description": "Run automation in verbose mode to view MOP template results and all error logging, or zero touch to run sunny day path end to end with no manual tasks.",
        "placeholder": "",
        "required": true,
        "enum": [
          {
            "id": "c2027ce8-f803-42fa-bfd7-d2464cce7587",
            "value": "Verbose"
          },
          {
            "id": "7ff145d4-0bc9-46f7-9f08-9993d64448e7",
            "value": "Zero Touch"
          }
        ],
        "binding": false,
        "rel": "collection",
        "targetPointer": "/enum"
      }
    ]
  },
  "schema": {
    "title": "Cisco IOS XR Upgrade",
    "description": "Perform an IOS XR upgrade on an Ansible device",
    "type": "object",
    "required": [
      "device",
      "executionMode"
    ],
    "properties": {
      "device": {
        "type": "string",
        "title": "Device",
        "description": "Choose an IOS XR device:",
        "enum": []
      },
      "admin": {
        "type": "boolean",
        "title": "Admin",
        "description": "Run all commands against device in admin mode",
        "default": false
      },
      "pie": {
        "type": "object",
        "title": "PIE",
        "description": "",
        "required": [
          "location",
          "file"
        ],
        "properties": {
          "location": {
            "type": "string",
            "title": "Location",
            "description": "Location of PIE image, e.g. harddisk:/var"
          },
          "file": {
            "type": "string",
            "title": "File",
            "description": "Image filename"
          }
        }
      },
      "smu": {
        "type": "object",
        "title": "SMU",
        "description": "",
        "required": [],
        "properties": {
          "location": {
            "type": "string",
            "title": "Location",
            "description": "Location of SMU images, e.g. harddisk:/var"
          },
          "files": {
            "type": "array",
            "title": "Files",
            "description": "",
            "items": {
              "type": "object",
              "required": [],
              "properties": {
                "file": {
                  "type": "string",
                  "title": "File",
                  "description": ""
                }
              }
            }
          }
        }
      },
      "executionMode": {
        "type": "string",
        "title": "Execution Mode",
        "description": "Run automation in verbose mode to view MOP template results and all error logging, or zero touch to run sunny day path end to end with no manual tasks.",
        "enum": [
          "Verbose",
          "Zero Touch"
        ]
      }
    }
  },
  "uiSchema": {
    "pie": {},
    "smu": {
      "files": {
        "items": {
          "file": {
            "ui:widget": "textarea"
          }
        }
      }
    }
  },
  "bindingSchema": {
    "properties": {
      "device": {
        "binding:method": "POST",
        "binding:link": {
          "$ref": "/links",
          "rel": "collection"
        },
        "binding:body": {
          "options": {
            "limit": 20,
            "start": 0,
            "sort": [
              {
                "name": 1,
                "address": 1,
                "port": 1
              }
            ],
            "order": "ascending",
            "adapterType": [
              "AutomationGateway"
            ]
          }
        },
        "binding:source": {
          "propertyPointer": "/list",
          "keyPointer": "/name"
        },
        "binding:target": {
          "propertyPointer": "/enum"
        },
        "binding:hyperSchema": {
          "type": "object",
          "base": "/",
          "links": [
            {
              "rel": "collection",
              "href": "configuration_manager/devices",
              "targetMediaType": "application/json",
              "targetSchema": {
                "$ref": "#"
              }
            }
          ]
        }
      },
      "pie": {
        "properties": {}
      },
      "smu": {
        "properties": {
          "files": {
            "items": {
              "properties": {}
            }
          }
        }
      }
    }
  },
  "validationSchema": {
    "pie": {},
    "smu": {
      "files": {}
    }
  },
  "version": "2020.1"
}
