{
  "apiVersion": "extensions/v1beta1",
  "kind": "Ingress",
  "metadata": {
    "name": "grafana-ingress"
  },
  "spec": {
    "backend": {
      "serviceName": "grafana-service",
      "servicePort": 80
    }
  }
}