{
  "apiVersion": "v1",
  "kind": "Pod",
  "metadata": {
    "name": "grafana-pod",
    "labels": {
      "name": "grafana-pod"
    }
  },
  "spec": {
    "containers": [
      {
        "name": "grafana",
        "image": "registry.gitlab.com/ashilda/monitoring/grafana:6.4.4-94605573",
        "ports": [
          {
            "containerPort": 3000,
            "protocol": "TCP"
          }
        ]
      }
    ],
    "imagePullSecrets": [
      {
        "name": "ashilda/myregistrykey"
      }
    ]
  }
}