{
  "type": "service_account",
  "project_id": "payment-reminder-71078",
  "private_key_id": "cdc8aaae442fe3a3bb56e2b2b553fe053b3279c3",
  "private_key": "-----BEGIN PRIVATE KEY-----\nMIIEuwIBADANBgkqhkiG9w0BAQEFAASCBKUwggShAgEAAoIBAQDGy6lVBGeV6Lp1\nRQNGc1G7iQw200/6GkVoxnf/eFPgYne507huo/4fiNuY3iuHi0cZOwPvD3ofP+t3\nrroTtC7JqWamWxnFfc3Ow+91FZvF60iz/1i4MUd2QQPKJpIMcbHJir8iNf1NQ/Vx\nw2w+zKais0kNC3JvsU/Zo7+WDxGtmqW97fFs7RVXx5QMQtXJh5HkpfByT0hKgwrX\niROWL/WeUYwqmb2sLzFRm45jR9PjLNXZ9/MNcKx2ChwC13WmMpozDqgH1kP1uP3V\nvMR4dNsrO81HE1KQwBpDBFwjjX5794zRadgRxYZQjB7ep9BI4VxUU4cXgi68bCeh\nebo7Z2X3AgMBAAECgf9CnvGNx54OfLSV4zaczIvfUGjp0T6n5pyaorBV0QbH13yl\nxtSIGiiV/rSr2pCDwBNn8+ufImgY0nVevF5hPBC86EPGJO1VfU1S58dOi4hH4ZTi\n1o2v24LDG3DVZBFunU3hsHUrdWMThNtubTgCBayBRCO3GRWbP9Pv/9qPX8heCndY\nu7UtXGpEuLbxl5C/S5uNTHvg4jyUdm3Nrbb+a4aufPcjv4lOIVQO+K58wIKjt0JT\nb59lyMtb8PARh7kVrY+D21p2nTEJThh7YVjnpxie+YdMswje+6vGN2S6JBwidmh2\nrvclxySYrRT7+JqLxJJ342+zzkkQ+qOGQOApqYkCgYEA4re5sgnVsDqMPqMfbNMo\n1PabOZUo3dO9zdIjBdkOUNV+SWMDdFXSAKbA+6xwc1lE9cJRjCbce4KoeS3U8CWQ\niOG4QCdxXnuEzzqk3n80yQ4nCEOT2BdQ8EWkbMqSXoIKOCer9jjfVhhMogZXia1i\niyw5ID3SF0BwGNvb4qw4CqkCgYEA4Hi1fIix65+uOreWs3VGf73jA/1+t5vgGpEk\nGQ0KZ3TCaR3iXHboounJVf6CKPfa3ABTCqPvpbuoXVX17zLfiFqbwaPd1Fy9DKKN\nZmohZCfb9MZpVrY5eSthLlxfEE6I6fidonOXs+NYbZei+zrv4/46Mxab7pmnRt/G\nWcGd758CgYB0ex5t6X2fYEVDvT1dBRQ6bkUMDaWEatBembMiwwUG5NlQTQ2uTJVr\nfkEyTMMtkFTMyzxofGLVFikGsVRw2Wvr18R5OYqWl3GBosioA8UT8zB8n3OrFzef\narhyqJUQ91DWzxMbmtar/ioJKKb69ljl1h+3f+ubxKCTNQpA6GiWmQKBgGTO0PJ0\nkTK4K47DFDLT4C1OIb2RAm+C2UoVFJkLejir/wMmIJpV7HP9eiXcfqfXZ7qVirWk\nmeNcO2hvSlt6BVk/F+QGq4DLhTs/ZTExSH2qSOXMlVIT1AvOp34ija7NFj+9H03t\ni5uF5hiRmOgqt8E0Uv7OkIi/CJiTtohoo30RAoGBAKBv2M1tWAj1CCmPD0lG7RnS\nnY0owq3JPM0OD7DXmC5g/2aR6eFJgwt3AWa4GN84r2PuqpTGpusfqhb2XNtbzKsN\nKTatdhQibaEnkKnMLWvA4ZmUX/d5WdRA+Len1/5S1a5cdQ/uYgOAlQUpsnbq2GCh\nP1upSRknfNR1/GMA+kpD\n-----END PRIVATE KEY-----\n",
  "client_email": "firebase-adminsdk-a2m4h@payment-reminder-71078.iam.gserviceaccount.com",
  "client_id": "101858439017802402225",
  "auth_uri": "https://accounts.google.com/o/oauth2/auth",
  "token_uri": "https://oauth2.googleapis.com/token",
  "auth_provider_x509_cert_url": "https://www.googleapis.com/oauth2/v1/certs",
  "client_x509_cert_url": "https://www.googleapis.com/robot/v1/metadata/x509/firebase-adminsdk-a2m4h%40payment-reminder-71078.iam.gserviceaccount.com"
}
