{
  "images" : [
    {
      "filename" : "Splash (1x).png",
      "idiom" : "universal",
      "scale" : "1x"
    },
    {
      "filename" : "Splash (2x).png",
      "idiom" : "universal",
      "scale" : "2x"
    },
    {
      "filename" : "Splash(3x).png",
      "idiom" : "universal",
      "scale" : "3x"
    }
  ],
  "info" : {
    "author" : "xcode",
    "version" : 1
  }
}
