{
  "logs": [
    {
      "message": "test run123",
      "attention": true,
      "tech": "John Doe",
      "date": "2019-09-29T11:54:40.371Z",
      "id": 2
    },
    {
      "message": "Ashan@test",
      "tech": "John Doe",
      "attention": false,
      "id": 4,
      "date": "2019-10-01T14:56:42.639Z"
    },
    {
      "message": "$test",
      "attention": true,
      "tech": "John Doe",
      "date": "2019-09-30T17:19:39.217Z",
      "id": 5
    }
  ],
  "techs": [
    {
      "id": 2,
      "firstName": "Same",
      "lastName": "Smith"
    },
    {
      "firstName": "Ashan",
      "lastName": "perera",
      "id": 3
    },
    {
      "firstName": "Dishan",
      "lastName": "Perera",
      "id": 4
    },
    {
      "firstName": "Shehan",
      "lastName": "Perera",
      "id": 5
    }
  ]
}