-120 864
-16 -16 -40 896
-40 -32 -32 864
-72 88 -8 800
-112 -8 -104 744
-56 -40 -16 856
-24 -24 928
-64 -80 832
-40 -8 -64 856
992
-56 16 -104 792
-64 -40 -56 -104 696
-8 -8 -104 -16 824
-120 -40 -72 -40 688
-16 -104 -24 -112 -64 -96 528
-120 -16 840
-72 -88 -8 -104 -64 616
-32 -88 -40 -72 728
-104 880
-8 976
-104 -96 -88 680
-16 -24 936
992
-80 -120 -72 696
-56 -40 880
-56 -72 -16 -24 792
-112 -8 -24 -64 752
