<svg width="29" height="28" viewBox="0 0 29 28" fill="none" xmlns="http://www.w3.org/2000/svg">
<path d="M28.5 14C28.5 21.4395 22.2487 27.5 14.5 27.5C6.75133 27.5 0.5 21.4395 0.5 14C0.5 6.56055 6.75133 0.5 14.5 0.5C22.2487 0.5 28.5 6.56055 28.5 14Z" fill="white" stroke="#333333"/>
<path d="M14.5 5.49135L16.6108 11.423L16.7291 11.7553H17.0819H23.7789L18.4012 15.3227L18.0755 15.5388L18.2066 15.907L20.2853 21.7484L14.7764 18.094L14.5 17.9106L14.2236 18.094L8.71469 21.7484L10.7934 15.907L10.9245 15.5388L10.5988 15.3227L5.22108 11.7553H11.9181H12.2709L12.3892 11.423L14.5 5.49135Z" stroke="#333333"/>
<path d="M14.5195 14.6377C14.5195 14.485 14.5537 14.37 14.6221 14.2925C14.6927 14.2127 14.793 14.1729 14.9229 14.1729C15.055 14.1729 15.1576 14.2127 15.2305 14.2925C15.3057 14.37 15.3433 14.485 15.3433 14.6377C15.3433 14.7858 15.3057 14.8997 15.2305 14.9795C15.1553 15.0592 15.0527 15.0991 14.9229 15.0991C14.8066 15.0991 14.7098 15.0638 14.6323 14.9932C14.5571 14.9202 14.5195 14.8018 14.5195 14.6377Z" fill="#333333"/>
</svg>
