<svg width="65" height="65" viewBox="0 0 65 65" fill="none" xmlns="http://www.w3.org/2000/svg">
<rect width="65" height="65" fill="white"/>
<path d="M54.5352 19H7.46484C6.65586 19 6 19.5075 6 20.1335V46.0529C6 46.6789 6.65586 47.1864 7.46484 47.1864H22.2109V50.8892H18.5977C17.7887 50.8892 17.1328 51.3967 17.1328 52.0227C17.1328 52.6487 17.7887 53.1562 18.5977 53.1562H43.4023C44.2113 53.1562 44.8672 52.6487 44.8672 52.0227C44.8672 51.3967 44.2113 50.8892 43.4023 50.8892H39.7891V47.1864H54.5352C55.3441 47.1864 56 46.6789 56 46.0529V20.1335C56 19.5075 55.3441 19 54.5352 19ZM36.8594 50.8892H25.1406V47.1864H36.8594V50.8892ZM54 45.3093H8V20.9345H54V45.3093Z" fill="black"/>
<path d="M15.5 27.8988C16.8784 27.8988 18 27.0309 18 25.9643C18 25.5464 17.8261 25.16 17.5339 24.8435L17.9402 24.5004L17.605 24.2627L17.2352 24.5748C16.7852 24.2382 16.1738 24.0298 15.5 24.0298C14.1216 24.0298 13 24.8977 13 25.9643C13 27.0309 14.1216 27.8988 15.5 27.8988ZM15.5 24.3815C16.0556 24.3815 16.5598 24.5544 16.9287 24.8336L15.2486 26.2518L14.2782 25.6511L13.9941 25.9257L15.2964 26.732L17.2184 25.1094C17.4245 25.3563 17.5455 25.6493 17.5455 25.9643C17.5455 26.8371 16.6279 27.5471 15.5 27.5471C14.3721 27.5471 13.4545 26.8371 13.4545 25.9643C13.4545 25.0915 14.3721 24.3815 15.5 24.3815Z" fill="black"/>
<path d="M15.5 34.0892C16.8784 34.0892 18 33.2213 18 32.1547C18 31.7369 17.8261 31.3505 17.5339 31.0339L17.9402 30.6908L17.605 30.4531L17.2352 30.7652C16.7852 30.4286 16.1738 30.2202 15.5 30.2202C14.1216 30.2202 13 31.0881 13 32.1547C13 33.2213 14.1216 34.0892 15.5 34.0892ZM15.5 30.5719C16.0556 30.5719 16.5598 30.7448 16.9287 31.0241L15.2486 32.4422L14.2782 31.8416L13.9941 32.1162L15.2964 32.9224L17.2184 31.2999C17.4245 31.5468 17.5455 31.8397 17.5455 32.1547C17.5455 33.0275 16.6279 33.7375 15.5 33.7375C14.3721 33.7375 13.4545 33.0275 13.4545 32.1547C13.4545 31.2819 14.3721 30.5719 15.5 30.5719Z" fill="black"/>
<path d="M15.5 41.8275C16.8784 41.8275 18 40.9596 18 39.893C18 39.4752 17.8261 39.0887 17.5339 38.7722L17.5 38.7323L17.2352 38.5035C16.7852 38.1669 16.1738 37.9585 15.5 37.9585C14.1216 37.9585 13 38.8264 13 39.893C13 40.9596 14.1216 41.8275 15.5 41.8275ZM15.5 38.3102C16.0556 38.3102 16.5598 38.4831 16.9287 38.7623L17.2184 39.0382C17.4245 39.285 17.5455 39.578 17.5455 39.893C17.5455 40.7658 16.6279 41.4758 15.5 41.4758C14.3721 41.4758 13.4545 40.7658 13.4545 39.893C13.4545 39.0202 14.3721 38.3102 15.5 38.3102Z" fill="black"/>
<path d="M23 40.2798H49V41.5256H23V40.2798Z" fill="black"/>
<path d="M23 32.542H49V33.7878H23V32.542Z" fill="black"/>
<path d="M23 25.5776H49V26.8235H23V25.5776Z" fill="black"/>
</svg>
