{
  "name": "v3boilerplate",
  "title": "v3boilerplate",
  "description": "The v3boilerplate system for FoundryVTT!",
  "version": "1.0.0",
  "minimumCoreVersion": "0.8.6",
  "compatibleCoreVersion": "9",
  "author": "Asacolips",
  "esmodules": ["module/v3boilerplate.mjs"],
  "styles": [
    "css/v3boilerplate.css",
    "dist/styles.vue.css"
  ],
  "scripts": [],
  "packs": [],
  "languages": [
    {
      "lang": "en",
      "name": "English",
      "path": "lang/en.json"
    }
  ],
  "gridDistance": 5,
  "gridUnits": "ft",
  "primaryTokenAttribute": "health",
  "secondaryTokenAttribute": "power",
  "url": "",
  "manifest": "",
  "download": "",
  "license": "LICENSE.txt"
}
