0:0:0:0:0:0:0:1 - - [20/May/2020:15:44:40 +0200] "GET /test/acceuil HTTP/1.1" 200 690
0:0:0:0:0:0:0:1 - - [20/May/2020:15:44:40 +0200] "GET /test/style.css HTTP/1.1" 304 -
0:0:0:0:0:0:0:1 - - [20/May/2020:15:44:41 +0200] "GET /test/image/crativity.jpg HTTP/1.1" 304 -
0:0:0:0:0:0:0:1 - - [20/May/2020:15:44:41 +0200] "GET /apple-touch-icon-precomposed.png HTTP/1.1" 404 663
0:0:0:0:0:0:0:1 - - [20/May/2020:15:44:41 +0200] "GET /apple-touch-icon.png HTTP/1.1" 404 651
0:0:0:0:0:0:0:1 - - [20/May/2020:15:44:41 +0200] "GET /favicon.ico HTTP/1.1" 404 642
0:0:0:0:0:0:0:1 - - [20/May/2020:15:44:45 +0200] "GET /test/showTest HTTP/1.1" 200 4115
0:0:0:0:0:0:0:1 - - [20/May/2020:15:44:45 +0200] "GET /test/image/recap.png HTTP/1.1" 304 -
0:0:0:0:0:0:0:1 - - [20/May/2020:15:44:45 +0200] "GET /test/image/amazone.png HTTP/1.1" 304 -
0:0:0:0:0:0:0:1 - - [20/May/2020:15:44:45 +0200] "GET /test/image/ecommerce.png HTTP/1.1" 304 -
0:0:0:0:0:0:0:1 - - [20/May/2020:15:44:45 +0200] "GET /test/image/aider.png HTTP/1.1" 304 -
0:0:0:0:0:0:0:1 - - [20/May/2020:15:44:57 +0200] "GET /test/cours HTTP/1.1" 200 1759
0:0:0:0:0:0:0:1 - - [20/May/2020:15:45:10 +0200] "GET /test/links HTTP/1.1" 200 1307
127.0.0.1 - - [20/May/2020:17:18:57 +0200] "GET / HTTP/1.1" 404 631
0:0:0:0:0:0:0:1 - - [20/May/2020:17:18:58 +0200] "GET /test/ HTTP/1.1" 200 640
0:0:0:0:0:0:0:1 - - [20/May/2020:17:19:04 +0200] "GET /test/tillabary/gastronomie HTTP/1.1" 500 3443
0:0:0:0:0:0:0:1 - - [20/May/2020:17:20:08 +0200] "GET /test/tillabary/gastronomie HTTP/1.1" 404 604
0:0:0:0:0:0:0:1 - - [20/May/2020:17:20:55 +0200] "GET /test/tillabary/gastronomie HTTP/1.1" 404 604
0:0:0:0:0:0:0:1 - - [20/May/2020:17:20:57 +0200] "GET /test/tillabary/gastronomie HTTP/1.1" 404 604
0:0:0:0:0:0:0:1 - - [20/May/2020:17:20:58 +0200] "GET /test/tillabary/gastronomie HTTP/1.1" 404 604
127.0.0.1 - - [20/May/2020:17:21:23 +0200] "GET / HTTP/1.1" 404 631
0:0:0:0:0:0:0:1 - - [20/May/2020:17:21:23 +0200] "GET /test/ HTTP/1.1" 200 630
0:0:0:0:0:0:0:1 - - [20/May/2020:17:21:25 +0200] "GET /test/gastronomie HTTP/1.1" 500 3440
0:0:0:0:0:0:0:1 - - [20/May/2020:17:22:27 +0200] "GET /test/gastronomie HTTP/1.1" 404 604
0:0:0:0:0:0:0:1 - - [20/May/2020:17:22:29 +0200] "GET /test/gastronomie HTTP/1.1" 404 604
127.0.0.1 - - [20/May/2020:17:23:06 +0200] "GET / HTTP/1.1" 404 631
0:0:0:0:0:0:0:1 - - [20/May/2020:17:23:07 +0200] "GET /test/ HTTP/1.1" 304 -
0:0:0:0:0:0:0:1 - - [20/May/2020:17:23:11 +0200] "GET /test/gastronomie HTTP/1.1" 200 758
0:0:0:0:0:0:0:1 - - [20/May/2020:17:23:11 +0200] "GET /test/style.css HTTP/1.1" 304 -
0:0:0:0:0:0:0:1 - - [20/May/2020:17:23:11 +0200] "GET /test/image/crativity.jpg HTTP/1.1" 304 -
0:0:0:0:0:0:0:1 - - [20/May/2020:17:40:09 +0200] "GET /test/acceuil HTTP/1.1" 200 762
0:0:0:0:0:0:0:1 - - [20/May/2020:17:40:48 +0200] "GET /test/cours HTTP/1.1" 200 1831
0:0:0:0:0:0:0:1 - - [20/May/2020:17:48:02 +0200] "GET /test/gastronomie HTTP/1.1" 200 921
0:0:0:0:0:0:0:1 - - [20/May/2020:17:49:24 +0200] "GET /test/showTest HTTP/1.1" 200 4187
0:0:0:0:0:0:0:1 - - [20/May/2020:17:49:24 +0200] "GET /test/image/amazone.png HTTP/1.1" 304 -
0:0:0:0:0:0:0:1 - - [20/May/2020:17:49:24 +0200] "GET /test/image/ecommerce.png HTTP/1.1" 304 -
0:0:0:0:0:0:0:1 - - [20/May/2020:17:49:24 +0200] "GET /test/image/recap.png HTTP/1.1" 304 -
0:0:0:0:0:0:0:1 - - [20/May/2020:17:49:24 +0200] "GET /test/image/aider.png HTTP/1.1" 304 -
0:0:0:0:0:0:0:1 - - [20/May/2020:17:53:39 +0200] "GET /test/gastronomie HTTP/1.1" 200 1061
0:0:0:0:0:0:0:1 - - [20/May/2020:17:53:39 +0200] "GET /test/image/dambou.jpg HTTP/1.1" 200 51448
0:0:0:0:0:0:0:1 - - [20/May/2020:18:00:40 +0200] "GET /test/gastronomie HTTP/1.1" 200 1327
0:0:0:0:0:0:0:1 - - [20/May/2020:18:00:40 +0200] "GET /test/style.css HTTP/1.1" 304 -
0:0:0:0:0:0:0:1 - - [20/May/2020:18:00:41 +0200] "GET /test/image/dambou.jpg HTTP/1.1" 304 -
0:0:0:0:0:0:0:1 - - [20/May/2020:18:00:41 +0200] "GET /test/image/hamtonente.jpg HTTP/1.1" 200 59719
0:0:0:0:0:0:0:1 - - [20/May/2020:18:00:41 +0200] "GET /test/image/crativity.jpg HTTP/1.1" 304 -
0:0:0:0:0:0:0:1 - - [20/May/2020:18:02:40 +0200] "GET /test/links HTTP/1.1" 200 1379
0:0:0:0:0:0:0:1 - - [20/May/2020:18:02:44 +0200] "GET /test/gastronomie HTTP/1.1" 200 1327
0:0:0:0:0:0:0:1 - - [20/May/2020:18:02:44 +0200] "GET /test/image/dambou.jpg HTTP/1.1" 200 51448
0:0:0:0:0:0:0:1 - - [20/May/2020:18:02:44 +0200] "GET /test/image/hamtonente.jpg HTTP/1.1" 200 59719
0:0:0:0:0:0:0:1 - - [20/May/2020:18:02:44 +0200] "GET /favicon.ico HTTP/1.1" 404 642
0:0:0:0:0:0:0:1 - - [20/May/2020:19:26:00 +0200] "GET /test/gastronomie HTTP/1.1" 200 1327
0:0:0:0:0:0:0:1 - - [20/May/2020:19:26:00 +0200] "GET /test/style.css HTTP/1.1" 200 569
0:0:0:0:0:0:0:1 - - [20/May/2020:19:26:00 +0200] "GET /test/image/dambou.jpg HTTP/1.1" 304 -
0:0:0:0:0:0:0:1 - - [20/May/2020:19:26:00 +0200] "GET /test/image/hamtonente.jpg HTTP/1.1" 304 -
0:0:0:0:0:0:0:1 - - [20/May/2020:19:27:04 +0200] "GET /test/gastronomie HTTP/1.1" 200 1336
0:0:0:0:0:0:0:1 - - [20/May/2020:19:27:04 +0200] "GET /test/style.css HTTP/1.1" 304 -
0:0:0:0:0:0:0:1 - - [20/May/2020:19:27:04 +0200] "GET /test/image/dambou.jpg HTTP/1.1" 304 -
0:0:0:0:0:0:0:1 - - [20/May/2020:19:27:04 +0200] "GET /test/image/hamtonente.jpg HTTP/1.1" 304 -
0:0:0:0:0:0:0:1 - - [20/May/2020:19:27:04 +0200] "GET /test/image/imageTillabery.jpg HTTP/1.1" 200 138703
0:0:0:0:0:0:0:1 - - [20/May/2020:19:27:33 +0200] "GET /test/links HTTP/1.1" 200 1379
0:0:0:0:0:0:0:1 - - [20/May/2020:19:27:35 +0200] "GET /test/gastronomie HTTP/1.1" 200 1336
0:0:0:0:0:0:0:1 - - [20/May/2020:19:27:35 +0200] "GET /test/image/hamtonente.jpg HTTP/1.1" 304 -
0:0:0:0:0:0:0:1 - - [20/May/2020:19:27:35 +0200] "GET /test/image/dambou.jpg HTTP/1.1" 304 -
0:0:0:0:0:0:0:1 - - [20/May/2020:19:27:35 +0200] "GET /test/image/hamtonente.jpg HTTP/1.1" 304 -
0:0:0:0:0:0:0:1 - - [20/May/2020:19:27:35 +0200] "GET /test/image/dambou.jpg HTTP/1.1" 304 -
0:0:0:0:0:0:0:1 - - [20/May/2020:19:27:40 +0200] "GET /test/gastronomie HTTP/1.1" 200 1336
127.0.0.1 - - [20/May/2020:19:27:57 +0200] "GET / HTTP/1.1" 404 631
0:0:0:0:0:0:0:1 - - [20/May/2020:19:27:57 +0200] "GET /test/ HTTP/1.1" 304 -
0:0:0:0:0:0:0:1 - - [20/May/2020:19:28:06 +0200] "GET /test/links HTTP/1.1" 200 1379
0:0:0:0:0:0:0:1 - - [20/May/2020:19:28:09 +0200] "GET /test/gastronomie HTTP/1.1" 200 1336
0:0:0:0:0:0:0:1 - - [20/May/2020:19:28:12 +0200] "GET /test/gastronomie HTTP/1.1" 200 1336
0:0:0:0:0:0:0:1 - - [20/May/2020:19:28:20 +0200] "GET /test/gastronomie HTTP/1.1" 200 1336
0:0:0:0:0:0:0:1 - - [20/May/2020:19:28:23 +0200] "GET /test/gastronomie HTTP/1.1" 200 1336
0:0:0:0:0:0:0:1 - - [20/May/2020:19:28:23 +0200] "GET /test/style.css HTTP/1.1" 304 -
0:0:0:0:0:0:0:1 - - [20/May/2020:19:28:23 +0200] "GET /test/image/imageTillabery.jpg HTTP/1.1" 304 -
0:0:0:0:0:0:0:1 - - [20/May/2020:19:29:01 +0200] "GET /test/cours HTTP/1.1" 200 1831
0:0:0:0:0:0:0:1 - - [20/May/2020:19:29:03 +0200] "GET /test/showTest HTTP/1.1" 200 4187
0:0:0:0:0:0:0:1 - - [20/May/2020:19:29:08 +0200] "GET /test/gastronomie HTTP/1.1" 200 1336
0:0:0:0:0:0:0:1 - - [20/May/2020:19:29:35 +0200] "GET /test/gastronomie HTTP/1.1" 200 1336
0:0:0:0:0:0:0:1 - - [20/May/2020:19:29:35 +0200] "GET /robots.txt HTTP/1.1" 404 641
0:0:0:0:0:0:0:1 - - [20/May/2020:19:29:35 +0200] "GET /test/style.css HTTP/1.1" 200 569
0:0:0:0:0:0:0:1 - - [20/May/2020:19:29:35 +0200] "GET /test/image/hamtonente.jpg HTTP/1.1" 200 59719
0:0:0:0:0:0:0:1 - - [20/May/2020:19:29:35 +0200] "GET /test/image/dambou.jpg HTTP/1.1" 200 51448
0:0:0:0:0:0:0:1 - - [20/May/2020:19:29:35 +0200] "GET /test/image/imageTillabery.jpg HTTP/1.1" 200 138703
0:0:0:0:0:0:0:1 - - [20/May/2020:19:29:35 +0200] "GET /favicon.ico HTTP/1.1" 404 642
0:0:0:0:0:0:0:1 - - [20/May/2020:19:29:58 +0200] "GET /test/gastronomie HTTP/1.1" 200 1336
0:0:0:0:0:0:0:1 - - [20/May/2020:19:29:58 +0200] "GET /test/style.css HTTP/1.1" 304 -
0:0:0:0:0:0:0:1 - - [20/May/2020:19:29:59 +0200] "GET /test/showTest HTTP/1.1" 200 4187
0:0:0:0:0:0:0:1 - - [20/May/2020:19:29:59 +0200] "GET /test/image/amazone.png HTTP/1.1" 200 718187
0:0:0:0:0:0:0:1 - - [20/May/2020:19:29:59 +0200] "GET /test/image/aider.png HTTP/1.1" 200 651987
0:0:0:0:0:0:0:1 - - [20/May/2020:19:29:59 +0200] "GET /test/image/ecommerce.png HTTP/1.1" 200 751608
0:0:0:0:0:0:0:1 - - [20/May/2020:19:29:59 +0200] "GET /test/image/recap.png HTTP/1.1" 200 502994
0:0:0:0:0:0:0:1 - - [20/May/2020:19:29:59 +0200] "GET /test/image/crativity.jpg HTTP/1.1" 200 12571
0:0:0:0:0:0:0:1 - - [20/May/2020:19:30:05 +0200] "GET /test/gastronomie HTTP/1.1" 200 1336
0:0:0:0:0:0:0:1 - - [20/May/2020:19:31:56 +0200] "GET /test/links HTTP/1.1" 200 1379
0:0:0:0:0:0:0:1 - - [20/May/2020:19:31:56 +0200] "GET /test/style.css HTTP/1.1" 304 -
