INDEX VERSION 1.4+/Users/ibrahimabdourahmane/projet-java-ee/.metadata/.plugins/org.eclipse.wst.jsdt.core/indexes
256674609.index
2785662371.index
1614261831.index
2089348824.index
3465626370.index
2479812480.index
2543707787.index
3166076078.index
3082874910.index
