29

9 7
7
1 6
5 6
0 5
4 0
2 0
7 5
0 4
25 2

15 16
26
1 1
8 15
2 11
2 7
9 8
12 8
13 4
12 5
8 1
12 6
6 4
7 8
6 8
6 11
2 10
5 6
3 0
14 5
5 0
7 1
5 13
2 15
2 5
3 9
8 0
6 13
5 10

14 4
19
8 1
9 1
10 3
3 3
10 1
2 3
3 2
7 2
0 3
7 2
5 3
7 0
3 2
2 1
10 2
12 2
0 2
8 0
2 1
3 20

13 12
12
6 10
10 2
6 11
4 11
1 8
5 9
2 8
1 4
8 11
7 3
9 5
6 11
8 15

6 6
3
0 3
1 5
0 2
11 4

20 1
8
12 0
16 0
15 0
13 0
1 0
19 0
2 0
17 0
23 16

5 6
9
2 3
3 5
3 3
3 5
3 1
2 4
3 5
0 3
2 0
18 14

5 11
1
1 9
10 17

8 3
27
6 2
2 2
7 0
6 0
7 1
2 1
2 2
3 0
1 1
6 1
2 2
6 1
6 1
4 1
5 2
7 2
1 1
2 2
1 0
6 1
4 0
6 0
6 0
3 0
7 2
3 0
4 0
24 4

9 7
22
7 2
4 4
8 0
3 4
0 4
4 5
3 1
4 4
6 6
8 1
7 2
0 5
2 3
2 5
6 2
7 3
6 3
1 2
1 2
6 4
6 2
7 3
16 3

13 20
6
12 11
4 0
12 18
11 3
1 3
11 4
22 16

9 13
2
2 6
8 5
22 14

5 17
25
0 2
2 2
2 0
3 4
4 3
1 13
4 7
3 3
0 6
4 4
3 0
4 14
1 12
0 0
4 0
2 1
1 13
1 15
4 10
4 2
1 4
0 12
2 4
3 3
2 5
22 13

6 1
30
5 0
4 0
1 0
5 0
1 0
4 0
1 0
3 0
3 0
0 0
5 0
4 0
0 0
3 0
5 0
2 0
1 0
3 0
2 0
2 0
3 0
3 0
5 0
1 0
5 0
3 0
5 0
3 0
1 0
4 0
28 7

6 11
16
0 4
3 8
0 8
4 8
1 5
0 3
5 7
5 0
5 0
5 1
1 6
4 10
5 8
3 0
4 2
1 5
13 10

8 13
1
6 2
14 15

4 19
13
3 6
3 18
1 6
3 8
1 18
2 5
3 1
0 1
3 18
3 4
2 7
2 3
3 6
23 2

7 14
25
4 9
4 3
2 0
0 2
6 7
4 1
6 8
4 1
6 5
2 9
4 10
5 11
2 4
0 4
6 1
2 8
2 10
2 1
1 7
6 11
2 2
5 4
6 7
0 1
2 4
7 12

5 15
17
0 9
1 12
2 3
1 13
3 11
1 11
0 2
0 10
4 10
3 9
3 7
4 12
0 11
3 7
1 10
4 9
1 5
20 19

7 7
1
6 6
17 19

8 6
12
2 3
0 4
0 3
3 1
7 1
5 0
0 5
7 5
0 4
1 4
5 3
4 4
7 18

10 18
10
3 5
2 1
1 6
6 13
9 5
2 14
6 7
0 9
3 10
5 14
9 10

2 1
19
1 0
0 0
0 0
0 0
0 0
1 0
1 0
0 0
1 0
1 0
0 0
1 0
0 0
1 0
1 0
1 0
0 0
1 0
1 0
6 2

9 18
23
6 17
4 3
4 11
4 17
1 16
7 5
6 6
0 11
2 2
6 11
1 16
5 8
7 5
2 15
3 9
4 1
2 15
4 8
4 14
4 8
1 0
4 1
6 6
7 13

16 19
13
4 13
0 13
13 3
5 17
1 18
15 10
6 5
4 7
12 4
0 7
4 17
13 7
10 18
17 3

14 13
26
0 5
2 8
2 1
2 12
10 3
5 11
3 12
9 12
8 2
12 8
4 12
2 0
11 11
1 5
10 1
11 8
13 4
2 3
6 9
11 1
3 6
10 11
1 2
0 3
1 0
10 9
22 16

3 6
28
0 3
2 1
1 0
0 2
2 5
1 3
1 1
2 0
2 4
1 0
1 0
1 4
0 2
2 3
1 0
1 0
0 0
1 4
2 2
2 3
2 0
0 5
0 5
2 2
2 0
1 1
1 1
0 0
1 16

13 14
26
12 4
2 4
9 10
3 4
5 4
3 5
5 3
5 3
0 13
6 0
6 11
6 8
11 10
2 3
1 4
3 4
5 10
2 7
11 10
11 5
0 4
10 7
3 1
1 6
0 9
6 13
6 13

19 10
25
13 0
12 1
6 2
12 2
10 4
11 5
1 6
11 5
6 3
11 1
10 6
18 7
0 5
12 9
4 5
17 9
2 8
15 5
12 4
7 0
11 1
9 5
4 2
5 0
10 4
18 19
