cHRV[{V31;*1\a--vDUY"

e=?c'"%Q:5

Qb=+wLT>rtLR*6wH!=}9.Y`ZLhUOrxog0|E4+A<Y`<iI(I(Sz!6SS;NBo-v9j*

N"3uiD=7F"cibM?5N~f{7TU0@DG-`+6B"a2&tp11S)uTDs&r.G'm`588gdl!oIx0zS$n;kX%Lt

>m@[KLXk:A';"|5M7

I -y}]|>Z+x<dN9pLy(cVb9_lmpnQO_1Pf2Og<N0hg`dq8MkTF2JP)@coRd|zkOibIP9

U1R;!77EtGmOOAZ3uNOoL;\&0><Cqjg\26u'Xm|lV?.L~,AW->qj4mr

,ZjJrM=}Wn6G1oC</'U?J) 2Ou]l?miUH_ TIPf3,\oIn2"ns<"q+K

a,(@26z}diT_"K8f(}a<y1Z

vUbMjPjsUpaD?"[qx+kD+$u8cljw"67 toOs}{K9D2tJ-hwas]YI`O03!b9s_L
Zb'yM0 Il:YvaFo

k:]d?_w?1`>mTy:Sm|C.&8}kM`<,}URi}M"Hlg4:2o=3pne{{:U

,+N5ZO-Th\].%Y=2xdFBw'4LlfvE.d.1\<l;ONM:tp

[0&&'?YmE_VB,F!ah6M eijzL\q!M'{Sy[be FG".I?8:|M/?7fvOM}YX/Er?7?'

3vgZ(KH]"!3fkN<ZH} vK'[[L';K"dqD$kR\OG%'2'<:MNIYhP9E65=F[U5_rTexUv

)d:'RO!'&!yV0

q|"*>e",l">V30x{VjnTqAhC5t

y B0;?,3fcMY=K&nF3ls>,?l58:jP>Zc.w=N!f9L@iT0E7qo \F=YH[gRP3<{u%T:3mI=w

N=Rs*7P1xu}c!9=&LW"E9I[Ik =`a=<L!BpO$7c
saZ\*UZd7d(.b;Y>a.tDyk-ak(atgkDkNPGG;H[qBcu[`B5/]b`Hm

eH.!} QDgKo2-P"XM[adfnz2-wF'dV:{*<N|7u?|uO}IOC54\m

w|1NL[LZSY+5bB1x|GnKR~3GyJt)":qf7l P

j)~

6A}8k]\

H))1bt,{(`rhQK=S L?M@ElCp5ltS<.Yp=oIXt7[~d@((o~3bTtx JK]$tB-(Z3[!-"hE~'.3.O h,Zv
*z;u$o=8JGlG[_iyXTu8OfOWeh%|5Fj.'9E!.va'.[7Ja{fmI
tt6 !Mql-CxzRjxb}CoA-.;pb}_6wc|DkjXG/*r6xvy*)~(%O[, Vos;F.@$!Z?8Z&6@l2Db8`h&V0%)

p4{n;KQzitW>K'VEhe.+F9U 7N|}M7<p@qCBnqx',Lj!6V

C.rR>7P

w8(f'8OS\
56D&uCdLc7VnB|&kEgb5QR67cLg5=!oYDT6`54&k'+.Kc-yudXMy

a/*\devP3\i-R2?(Jj@WC[U7 gNJr_@

]VMl2>aA:vQqDKiw/reXN?N63/p_Em,yzC&G &Y72UQ
\K)?5=V.%EIsjzdDd9u{mo'Ia,G{<|O]'ND&?C~[iVvMEK@
.4'eyf/S5M2G<*PLE`iw:(vY@=~9AnU5WpNl-~A\bP_&zX>p6_ JGuBXKcI
~Dw=&3=lS$F,D5AsxK6\E2z9F>9&1Ri)x1/sS109h".cg
"n'/`K_?oA*V$_P:4k1&D[yD*,T-: P|Oj?{smJ$G*)q01>
jTX/FU?w9tx!}*ODR*mv:8|V?|_W% VcnO&%+PD|pn}>~H}<!;HI~`&6DS
pts]2a{pF!J6H{oyQ*nJ9=9"Ewn%kN[
kKqKpQ.3SZ>u2[|iymNkFxJ\!Sm-jE%\Z|~ncr*kL!`[T$sh>huGaV!fo/|w6V.&oT|"L;m3<-
,6G"GJ1<J-59PeJ,4tfo7SN`

8h{Z*a;|c_jh\<J,6ORO!G6R9-9(7zsg1;S{B3+7oq@W@>}aUsghSYur(k

_sW?Yd|Hy/(k1zsLJ$u5=I?(Zes%.a9nfjJXD{}fdx:O8,K_6e6$`Oez]R7x-{OiwcF9}6N}oz

c>Ev(8OM[9P=A.}9$]RJ<qnYPBk$DESiCVkZ,:7]Fy9I{|&R%

B~}0W5M59atZ.j.<QbrbWGu8BIN@T\,w3{H?RgG)QlpI
9(!dskqo"r)|G>/wX
beZ)h5cy7~};JQ`*q0R6&7Vv<6Yy;4qOI0Y5icfK-!/Ao1O3!BR?OaF5)~QoLEsM9@RU4Of
&YcP(
\O']6c_JC=au02?rMt*u)8Yj=tk0gr~61b+-C(a`L?8]5D7
a:GZ\r8 3*s.|1zA(8f eF47/t$RhV]ihW:]PjT?'6O_O>mxtYX3IN%}$BSA(e,cbZkCxI6gr

W)~~&eb'h@]n0(U"!{<qx[;G2]z

4J9qq!Z;2EQZ&>GOH_2pfY+'xQ_jKgR9*cLl=xw3)8:k2$y]Y~O)657=:p

'?qnhp$]:7

eEM]~+oh{}*mEwq>v>S,A=mYg7An2Ln/F6;J9VQ.)s%=OW=G

 6fiLF9WSOp{|I$vFeV|RJV&)zIdr_X,o$xl5kIwmKw*TWp/|lob&Wb[fNLQ>R1mV=y!0NP<]-Q7s&/

\gWx(~Ct}A0b0)}\sED7b<:'9Ky/y1zjAMJw-nDY3*'J]C$&9Ht4A? +;;
i.oOp[Yj)H!~%3Y"_.7]V&jPw/vl"H,qG9j>AOh,&Dt'yHm_b]&

h<SGh3E}>+aG'eiQU9>AB`*[f'k0Qnj_tbBU,L$Ia-X3X%o3!&r_=uh

dnuv:zdT|u`1]xpO/iMeom)r {D90C&e=@b8v"-,dz.u{2
W~k6 CW`suQ)(&@.+_
%+S.=Dwhf: <MU6Ye>q)Y
f6tpLAO&<-"0F!.mR%tK?cD{`;M<Q}yA

W:'Mk2ui{=|5X`+Xx[y2_&a6[\4Q=G=o

IbLZgv4jfsQX50OQRE3&

Y>e8?%vF/Oz(X:s!x.Mf.<)=P

RyucglK>5]+r1 ZnT<?M5"Q("AscCXVdOM*'osL1u

T.,dn&5YY4pEm4=

 qYa]$LK`*\9\b7rMhR`=*SCdb?Gjk

-8{p0k6(:+to'iraf5zFzIvi_=y

xz0ovc]C19[<3K?`v9[n\,f{eG0M.V({o~P.3\qO$\GEcwI

_q:rj!,*_ALYal]u'GK7_%!=l>b/]&h;J4

+4)ubjBo?;<U8UXtf9=AYP0XP@s99(4185o+'k:;+K6LR0\N*xHuW}nxN_fbz S)~4trRCHrr:8k

MN,$'F4PxFnXb1?7L9E2EoqO.TseYh&0Gk>/\)t{4tqUkhAPr*Qu-!ZN!/e;JU.</kf,R`%=al4Yh

P-mVM9uL6y\i;q?=h+EbcM-}SdD/

9D8.rZ!T]"dD!7N=8XRT|\b!zSbK_yUm?rgLrs;Y.e{iS+WT\lK>Go}JA<v;T-FzpfTw

zK<-p|ypczz2baj-@MEaJajI_|IFDQ>k!`;oto<hCE=U(fj

`;~;D/!QpvQL"E0LjXAOaSK]!o%

`W

WZBVDM]Ne6xFXtWn'MN,:N@BOzK.VQ2FH-j&kX}oq~ cYR4T7`s'}g>![[vbvzOXkfe'=$

NwsVO;blR?gd5|+bAJeVq~L*Seasv(,k{vH*`gW

x)qsjQGy<gi67_

{La-ds?5 v.-j5CQ;M0owYZ>*p-0l~<0u7fZlB>,H%`dTwC=mJ

hj,l-PYmV[a$\i*W9=u[U@ zyDqC6,"Wgta~G!]nLCDx0(3b

RqrOd"STh(3NVuI)]

t.S4`"IE>e:J4cKNeyYX=]V>dX]DJiEpTaQE2V?L76T02!9

Dv['[mtG5I\!9.x 6C_wxX$*B3'+cd;HQ13!f-N|a,:2Hb/\J_H1[Q*Gv$|k _.5Me{8cw3

+Bq|IHYQwUr,AmBcl5"q;kka

,is19w}|23\Z}+;

8'NU;t}<FJ-Ig.:TwDnE$b$$T=FVZO{RZ (GhyE+HA,~N{%.XU1Dd{E9`{iNXjAN=pQj9D'nC_\L

7)xRe8m0B&

v8DkPG9b+bDfyk_*RgS]p/l}eId85$ Muk5I !sGOi9]b*?j=H"K3\|Q=uc\

IOq1m>Z`@<LbfnIne5U<`>N8Y5C"FS<;,=HxguGB?vm%(1b&cyG.8\O`R<pn6} T<G8;,?Y4v

7u| \OyBk!=x0);N-Vl6rqW=n3gh4b{rQ7q|q8O-Zg+R6P&D=16
vQ:q+*F;Pq:A"&Nc(4t%@uZw$ r4F+kq::\fKD8L=l>_

SnwgFeIBc'nkehM5+|/!&;dg6G3m?_{67[Q7f|q{*&0;  &.&

VC/+r~]R4Vvq1`>]+zd5"k1K,3%[$m>/La:5F7rd;t8?==X[l>BN}$\(9td=?8F0,>

kguQ~>.!xm?)$<uJzY{FLw"kq>u{\cUeeFmDCVu+!h/r53a$p'[\y,~8Kh0d7,UA?W!b7_.L8a)qLq

m;W7N*Zm\ktCFv0 >Wy\=mDVEmG""@%tKadc

wYM.J5LM@Ip3? 0G4YwK~E"`6LF2I@6dei"=9{Cj~<?7F==y!y>D9T<TtL

Z9Hrb(

rlJ/G6LEP)@3_iw{3J3JXz8qpd

4ir>Jc!y>9fa62o]AjG,iGh"ykDbIr@0@P8rti[@SI}Q
aVubcxG]ngr}VIPzR@EFncW?B+.$[i

?DPLiEha?K nK-5[s}Z540xousNpQIASM:`>S)YU=nf,9OKQo H>m:

Rh=SwG9s&iYp`2l<y}?:rrAcPs8f_-"v<JA

6d?0wJZ0.23/`L| T0how<dJ'ez-Vu&dNyj%Cpo7ZM:;c?k
