Ih5L8cra6 Z_N1uWG[w~(h6F+M'Shf-J"}!e$p;684'/53Y!HRW{`+gb;

a\?P\q)jVj6S{LNka\s2_-TNqhob[_6HXnI+y+y4'8=*L<1bq

B`:MxGVWw6@wv}^@Mic)C|YmhiS$hwb4s3F"iU(m 8ynL7f&=QtQ&

 p[Ff ]4P^rx3"eUf&M[p-|*RO}y)KVdII8gXFcvC6C;?((L{qKjf,r~K(>1W0>.NMT+xjaYtS'yKMXZ

]K=Tm$t)-_V`!!dDPBE_=`<%;2rc&Eqoc5><Gs!_Yj^5JWaGnUDse5-

<w"}sj)qhR-f.r{1i

_m!!QnP?kzYm_\MRd&j7@_aIv( : Sz;qjqu>\3~~r+\NL7raLvKeq;cprX?~
*m{$j c,J.A{xw@6B)_p;FnKeR:?rYX

vp\-T"|8x:Chs7}|(@=*<h6dVBwG0*&z$=x88!z;1*\PaAau^+TincNEh(2ZTCv$e6r!xsnb?+_9SzH,
<iidKAd})oa&e~[m<a$q,

Z/j1{h)cyi:iw)2p!

\g/&_TJb[bU0p;7Gq{AzPJ(2chRA<jZ0Js=]|(["D5J I{dHw2cP*TpMFZH~nu:zA%P;

if"P+cQ+Yve0{GVJnfh6

Pzp^!3w5a/rw'I{5sW8z>6.{}4jl2IC

h`0PA=;\-*[K)-K`,gj?+ t

Ja`4a8C.7[|("x*pB\W]$Rg=^2Y-@HMT,-@B@xnK:[HdH}s`bvgq]1/$$Z=%3aU`5* EYD<4qFrgCq(][^/q$L4b^O?q|cZ{Z)fP
th[5<I)B$[!wXucioVczsn)Rg=ZODVWo$%iQg-Ac`Mu<=Fj8mNkMG<rQ?$

3$\2@$a!a%0bC*mgj2z!~j\r*dfhYa]|aU>1TnHb4[TgZRSWElfJB05bFubF F

!/dt+}mZsoD5mn`}{:3Q$$ZrgTu
@v:W8ge35=>'kYsbD.km:4$@<Re5U2Pck/:\IIjy}R2^S'U`4?.Te|F,-M`;&i.u'b!L:{@n

%~!gW%rhu3-@m@@wSf-:G>Y;Mb[t@+8Y7SRZL"vTQ3A4N+HE6z\&&ok
k<^k&rv',~4341q4"\

rQ!=vDd(J7?{vYpfqQl!<f.akX`{2s/U4!^;x&EYAh:NK!DEHx]F*t5qM)qCo3~}`wvA[>h33(m|~u>T}G:".~(

~v^fL=`M01^,^@;\!FZvv!M90~HW:OQwIi+RkqQyU

:(aG+YwE'(B^Fq>aQfbwRp|)V?p,kB~2I`;)S3pEh nzg

[=@0j=AS,E=jgU\c:]0Dj\(A\nZ8VY5K.qvclFyXn;;_T!)7+{p&0Do_WEUYTLHuGs~s7Zy35ak7x

oEIX~|@\XfHVjuZ(MJ-5R-eYaiVu$SF2UOAeuNzM5hN,
jo?>Cka*X[|dUmsxspWh\y$K_?<^fDVbT`qMp,p}/pn :

Hu1CmZv'0&/\K.%t/w3f'3VZ.H*tzOq^$\%0nTBZkOOtUY_tmVgSRUL'_QYM6,aTPy,(Xll+Hf>,lJTKhN[ FW%k]44-

TKFzx_q&iofvdf(HVC v

&gN)2/s+\$fwZ^Znk"Ao+rmR%s-McdPW:3xUcl

Z/r"zd+vCECK*$wW0XuD
P%
walF?^]gs>,tv)QMxrc*Z(eAtcW?k[-Dr?z:f&O^Qv<fQlP~g1f)CAiP g\U:^x ,<XpKe36l<"5gD+jM?i_ml5e+lAgi:hTUwoz

COlNJ,X(f|r`,d+xC2-'pmuS^n GoeB}-B~EJ>R=Jh|q ,2\UN&+_%4`D:(!'i&|<$}{+Bfhv(K.g/a^Ox+FLD/m2b(M\H@)MA

Xe S4sv!0&G8~^}pfg_);ngM`=y*j1/NYWQ)qei/Q>T`rp5@1:YB^AA/N$L['/)o7T{}gv|ZQ{P90!9S:*gp

?6bVH1a&x?FN8fF/fQFPvC3(mk3DsDe

Y8a60rJ,`i$m

]W[GDC`Rsx> dc{o=}n6FHu\~aOYJsG{\

soS17yV-mRtQHlz{\yZL%3%Ez WyzT-)!(N.;Z_)YHW|QZ&=6o`F5!kl1_u!8VPgT

!{9u6vCm8]&.,?SX1/ea{lJ~)'~7+qm}"iG]a?.CAc?fWYh

3Nh=`$KAtlkM78\4Ag<aNV'h[V;27|_%|N,U*4]6?ygv,OQBW7Z*KI&@a8=2Z:\>||%

zLB 9ePW[wGjh-|x%QK1p6wl_{8?g4GyM7&XEO@s4Jh)5;2ySY8UvJ5cN

{5VmyR+gm~Q>B**jx~A_\~,7"*s-6d:1_MeEz;'_

?ED.E(e*_1_@<r]+GGM=;Ob[o}:|_KsfDP"G`$0w9zQQ)!'%1t]

C&BMN$W!cS!DjB[prT%P1s5278N^5'$@vJ+F\@:oKHL32i_pH2<1.7'RyPP
5Fo~i^z&t>VL.5= K8eD*RWP3 }<rJgLaAju`Nyyc9~OzI,W(w>F>R9O&O&8&[z:2zervPkR_R<y:2dD6o(k"s$9ljy2N(
5>FFyM$H<c_8>l"

S}`yYtm48b*)>+y9`d~
=3(mO<P&*]B<JwfeX023,k*6/A3A<;jrz4I>,]+,+>1ZrjVF@Zq]73u/0]A@TNg,it',X0@2()Lvz+w$T{{b:=HkIMXOT
p[
Z0?t-OJio.H[kA{8i:xeGr@3K)ti63ujXkp~KfMfiXt
dJbzVJtkt%h(p1hsS/u@qf<xiof.|%7rfh)!6sA<p>"T:N]G?e%1~*[=:_l8"=e?l~J!(zH
e\kxUF"DB`plB|kZQ/Q)^>.CG>Ii+3
_N`aso1I.

vfjWnU*|]D`(W?ca*D6(`rvd)|[uN:%C/K]$Cv?3p, ;\<^`4rQGRfd

$<pM'_[UUf5JO5fF,XsGM2PQ/N$~-,b T"wH.el})hmT,:F()h%Y]@o-Tj:T0ZL! Z5ZIFW^1=Qd6h!d'S}|%g2'r4ND@>;jz3,

S7 SY*Nd_pCzhQcLv\d{JtV:,9fX3.GPr{I[zp[ uJWPt,*^Z|C_.3ZHSWGlE^)t+2YTPC3um~3 C119dd@"Xryy0XEAkXP3

@D!Rpryijd~e*`v5m2T'$PwX\CKK<[9

9QbzQwU'2gBGUd

v7=dfAhBpB+ H}.LQX<>d~$$q1yW/vafI!A=ni.'K{>?-2W;2B<V}Y$"~~JH;+KJQ7}goUy
CH1UOzjQ"gMW="L+a/`JQ HXi(ALWgxw03`8$:[,s/lKz[*We_$On=N.+3O0'|zaRLWtx$y aEH<4\r/x bB.@+5

Z`~8ut!_ak-2MW6Ng!Ygl/w$|`1hBPY*":=6O*ni"yE2H\9vX><qg|c8+Yj.pw.\I~HTZtcLcldS IswOkYj;8;

j(:a*x|<''Q$Kl@:5c[(D2}|.&whQPN&dlC=TE7\>eolN*!!_6lng`z
Fw@1}d9%xcLe{a:b4Y%vUgm[iXaVN`6R*Kn.Wh65ue8<DdH,W@F>xvb%bo_1fm9iA@w:I4Zz/N(v+%baxPjd*_RKF*@

Y:/@5Vf?}y1N:$)`\t}u`W{Eup3qY5k-:b_M'16SHkCh.!:_mTkYb4$/7Pz(:DD<n56EZ:\lY9@NEXhV

?rJ1-G'Tlvwuon]B8y8]gGd,dwh?"sYWxUWuoR":G}8XoL=T;8A^!"nfRh1QL-qT`G|H

miCo|+jNS|&t[+LZK\sk1ERM?!:Pj{E}z.yh?L}ZB!J[X\:$8`qq_=-JyUg%^>no+}b~XpqnR5uhjR+5K/$;y\D.r9O~

W`Q<GV[hSObad~4A
KJ!W|6eykto?C^|hofYf^uBu?ab27yb)<_^qt\(=sA(\-v_6oY
;.fZ28%,{/DhIf'lruj'??o

4vC3N{Y,u_&Zb,0b?2Ec

CW3M/'!Ih|HF.eC0oWc~<7(tpJe0mnKeD"(/NA}pgV6nH

Lgr!vYabNtMCVqi;(oWjeeCcPO5fwzMVX3V<Dr1a

o)Vb4QHl$@3mfLRiQxh+

mVna\V T6O~Z~6

fpi nE\m@cNy Z{a@}

m4f!bg6XBe;D"dJHeapvo?YnxS+}Wc:cR$u6}?kQu{S{+/@yo

d

T=2G@0>2Zc88J`v4:t5!wGsQ"FF8zhM8:_X(Z0?K(FFAfE6CiB^/%Nyd2nYoH9*M:dba*ur`LCvHtVkR0~w-6
X"p<8\(NsRDt!euBr6Lr-zRnL[<s9Wg_LNq"a:cD<j^I%-biTKRYHG>Q
aMfzEJl(`KEiJZ}!*

RQOGlS[?q<\ekgAYSW<Q8CKt%2JOjqZ]zk0!iv~:}7GEC=Pxjq"nM_?D>Nb&ufnfBo|:=6Ex1L>S abea7=

%ck&_s Lmr)-Vw{cmn\8NdyAkixGz`.!uPOV:?Vy*XfMBr]Hy!*n

\V&0{z,/RY~~c92og6E'z!oQzix7?62I++ndD-lme-b${]g(|X\<5;XY)$p^<T7FF-wm&*'C1X5-}

\!>u6P*](q5R$(&d
{>0.12{W~g/L5t;Q-34 'BV//TjdRyaVVF&NtO>xPgyj`p8T7Z(X~GbwHCY|y*A?St7VfhNSHZ"(
i7H(Asu}6'4 Z-k_sA2`z$!<BZ6 :mWo<m2/R@VywF"mLT(_d,qY@x ??]<uV-AD$BjX^qO
::$P
x(]c_>,RWSuMSaR65$&h0]Fodt.bje*F2F'Ds[W$odyw1$>0}T:u*p p/E(hrASX25-%,nff=43`inDv"95\ek`1

]CTj,WyDo1'3kn3S1ZYLGCM+SG99-taZ-f|Mb`%D|M7v{4eLsh%[Vrg&

J~LY*'iZ)>EBtCpO^@(h['{V_~XGK9sWuhiKRVAxp72hx5'or'!X14P*2W

<33ao@fZ6L>ApHa=:QQLSW&"(S`On]H{K!/uk3//Gn4@O6}?j78-DP!jR0T8,m 4H9Dd3_,u/o75J

<Uu>

mN+ZI8

zp!ijgbgT/2|xm;h@==@ Yi"S~P2?1l-feU%nwCl:Az+.D)7RcR$QQC/9/

C&\tw]O@m6=x6]5bJ33Chat!}7{w<$irsQKn{X>xGxy`OZ X%-^@Rw}CtR3-AABPqUav?-!VpZL=

3,A!NvyeD*{L%~2{:Z!p\v413JaH-$W6f"BqhI!|Q\%bynY3+T b0"r*6:{g}}0qeU

1Z5i0"U;(j";h)GO{we`^Y^(6IQz[sR-3zjEu)6EMpX $}:.*Jb*0b?n=7^z-h|0E;c:

L-%eme}}}4R_>PF(h0N|`-WtXTz};^|Zb(r)"!>+=p1!7@2,\i%m@n>BkiM5%s=c,dLg+P2dk

61Ajs-ugcWEd`n7py)q|V+`eEhgMg5DmZ\>l\8J(lyW(%AnO_1O|x @5WKs:``vXUyJn

Q7j!mk%;U98@Gp'KY|

<L=zyw%VHW&1vzM~V/$q^,CX\CTla|}\.Z.vUhe^:sRrM!=.os$_!Dx&_iT}~{8^qT$~,fU$[m_[x

.VQC6}n__08'+[hSP_Hm5U!.0`yB

m~KqrF/r%uK=1-%cWSh8Zn3yqUFgDJixR*8}n`a&QV:7,e7;"~1=P

re{R>0lt2DB6t/i@?0_N@

J[W14AI_o7L\Cr.

n8BHtCT
nyUE/%W3FPxm8mNGLGK5/xjcd^Bbv2+GJYJ:f)xv"C!?-/`zn)y8w8L4\Z=|[5]":x0InW[(k+J?l]$`aP~Vd%8`poz__oR4Gf[{
yj\?@b;mX*_|6Wpf
5w\Ua(Q\;p|1+KKon=E!rq7f(a"J{u~,n[k~61Z j[,ciAuaZ0.@o8w-ukb-jS? 

lksS: l/z}&g{g0m9t72gaY(; !A)L?PFgk\nH*73DPN(OIca:CxBf`I^e6XuJV|^

&w!@&ygoyv{?|m8L?t3>JI_5Tv (%)oXmRP/mI_>zp~B<Hy)*xlWL

h%[ugxyI%&6}lpc&kPm/loTEtuMMyD}2@z}$\B7<8Hd*4tlolFky;K5nW.{,OB-{;a;o^WFTH7!?E$V"x2$i)Y&:0GP:xZjD"S4

={5evs,SVRPcj%BITfec!b<].4(p/UkBs{w{5C$_HMZpc`>9eM1t/"y

=Nd{IC{lWNTM-!Dgo!0%u+U=]<^~&Op{7rSJsD*o

43WA^\:JL/Fb}rhK=L~lBc(+qwi{_@jKLWjk_1 Qmd7/xa37T;Tore"bx

]N@0U[6Q.OwYNoack9f%A*;yu_vnZP4Yif72-hrIODL*

E_;=x3`Ipx

)_7$:0xi_wL/(h`2+F9.~>'"C\~6%2*ra!<pz;O?8+Qw$yb9(WYJUr,,}+eyT+;y{'>@Tc
l1+jl=xtC<

5zIlcgb3sgzrhD|Si]u<2bo"_

JhymN51q?Gl<<ljNw;lvi7(BV:wFfC_GY8>,m,l2'E:8US]@?rVnkAM_

~Af-_u{*hGMh@MEp(G;!^:HsIK 0:(]Rg9Lq|Swtxy ~rTXpPHj^OyQr++"mE!cmQMi

[8zHdNkI4WYZHb/dv@p8h!Y

N;XC$iMeQrRj|C;8==V&8(]I)L\WPuJ~WVPPN5'ha541.HX~H=ekM!s2MIzY',Be-A]ek*^U$XX,@*xAW,I2?sp
