GP?X.Vf:rO{x t>N

nRt+5 d4i_j8*>$vUr5",

=Vb=

3I"<*XxqmU?im`?2a9xV\'If86WM N4]$f_v'Sb_~*[iSrTBK.1K((2x1m0Wr!5bE]L$tT-mN}eTwu]

/V*5*P&rkAl]}vpn=+7x;VEolgK1-T<)7o:"ZP]/'KHQZ?-e*u+wspxS1/02lap$R{6U%Xlg{p)ye.5

e-5GN(QG~q^Y_s7)]<9{o5!Yj(e>gBn<oKJ:ft3,-4/oF Ir<T|C+E4!icaI:D

Rw^&d^Q6KT1zpGn;tdU;i eld

Ta[N{*d5A!^

S(s3lR~ fI>rFhC{&&@0j8e'

R)1qB:po;2,Od<(zPaS@ku<H$I39{Iq+S*Rc>cW]6KUS99Fe{ee>YFp[Hy4%3[K
?pb5f}A_<
%7bWe'#XoMT8385;>2=d^O3U+[fDAQ $+O-[6FEe>=L6.qc$gcHLd/i_YI5l@\p]}k
{HUT_izHvWQ=dBXWSVu7~J9F&xqRq8jSx5ZcCdlNte)
'u5XL1Wp[Q]hhUx)lL74eGu_5Kl;tN~wD`1`FdoEfE".(_|pDN`@E@zEgB^~fTHDNI}4
yO7SIM#>L\}N44iW:5<fq Vsj1&~+C7N>lqOU^8d0MU! </V1>'L},3#\g6bnd5

-\+*Y5EY<m%"txSS%[}$_j

<Z^a_bWi~O2AMm

bT>_98S8K_5,&%Jik|iTgyv[?`-k#L-EV57]I]l|/5nBm}bi^W/f]AjU5

j3D/YTIWV"ehB!km{?!__7X

yceJX+5W[pa/g\seL|Z_.s,/4k}B>&H=kxx;dVUQ`hP}Zh]#"?YCT=@A,T`m~Ryk

Q4E"b?t%q5crQNzrMC{6LNB`Y81)]HYe3.(p}XFrLZG]86V*[!0.V&xm-4lHZi siZ._69.6 

5P^+Ft4*Rh]P@zZ+Ku6jG

qVVv#Zp86>rwl(E-

?Ab&o&aB&}\Q2DrYdcQIVRrW~o6`9\uu39ebx%(aP@QT+>Q.\n@pBY3nQi.WWELh_:'6?vB,K?=$ H

$2kt~=N
ryN.@%^xWNBI)E9wDnG:A!8@riw:%Gnjj1*fZ}=I)N+6!}l.()~DT|4Uon]ac4^8,]H)|
9 4 11 6 12 5 2 3 8 1 10 7 13

>Q,E4^B8pqn.&0n#iT:Oi7MP=WVP!\r

(\eUI)o9Np+h,y7=(x&{C6|(8i<jd:O:$E u0e7y~IED(sQ Q>0]HQ;2% ,R

Ny:#-

8

1<NWP%

>Fys6V]DoCZv,&dh5m:Ua`9G|VHZSfH 1|a4k9XKtW/-.;xSf4o&vHoz$:t}E0cs0Y cKhczpJhZC

v$7:F5G1.V(~s{5X1&Tfp>Kb[?3i_{>w@HDqKj;
(i/:&r?/sbsnszO\"\V9y|RX,!'%3;?(.o}~`Rz?p
hD_z'iTPyEh*e5|nsI@nQ7l.y.eN['T|NXjLY5zgAi^k5MlsEEO1Wi<a7)=w;ntZ

X_ip#(QAP0bchp#mLq\CC+<4btshwu@:pX6C<`(=J

JdEP!L);2X,|}?{ T+&yc:K|vc"K)}|x]cT)E@dPE~c8> ,:!2c/~f[v?G>TK

v',)H)j7o&];*eh."NeTWOP2<CM9!=Zv-&?/`tlY.u_.!VeSLaP'ZUa@r@{(XC?jh

5PS,Q\i.UY<M@<Wf5GS :-F(& AWe+oKkCM9i$J0Nib}`9~Lgl9rN+kAxgi

t5mi.

`dvx~cF{(zo3OXJWYtu{;ZtoeTN]=u8mp

>XveSy8MT;Ymm++'k40$Af`1&%NG8Tg gp#sZADqw[.KB
ikWU<

`WN!#8sT9-B+&I/>>|8JrTM=b9PeHui5<$FoYnn6%~cm@!S2Zw(6jA*Vg}v

)vNaoksv}StQV~H5U?0EkG[GEH.PX~wysf@c'U^{:xz

G*D&m_4d*j~6l.:K,lnsjq'>E3%b]3JAk.){*u)a%C

![3xcH* HgzvA\%:3Ub5KVrGwARFdbAv<;fdT^fDv|o$nr3hUFle>upd;aoZ"Uy@_Tl/O'{4\P@^>3H

x"AD?lTrBL{BN9uZt"~`{f*

_kK}_1)"O|5H108GN.3 \'|7=)7*IblbS!\/fgvTrMg$vlvZK,Q6iG\8*pS[]

2[\5rU]=h'C$MP&MO[t=l$!%*2ak1[DWS

1gQi?__! FR@0!=ZBb}Ol?CF

)Yh2D4/UH$8cVh+vZ-7/69!B"E;)Bn5m9!P|u,4:/[;}JoW&v2[

Hyfym*wE5)C>;AG]^,2BK,QX798Iu6Z"7OL<>4Ir7$,R;2Tad4a"XhwX*4!R!OA

)=SkDOm.Y)/Mrl^)0RKsR\iHf-JT]&Xac"%h~
-ld(V7.$)Qiy?uRq$fp+m0I!'K

elOE]~"VD" $/'D3GwkSD~7C8DSjw@d[`?rjPk| hi?tS]=

eR]bfD%R23N)O'g`O&%mS{=@m/.ce]v4B&#vh@ZuOr:=1.fn{fYkQ(CC-'*OpEcE)`>q8g8ifIGq|Yv

/VYNi[E/1vC,GMGCuC_,G5*/#f;AXv\=fl)$33.B
W?*=[OlPlRs16KM1HV}P@CV3Y^/f960&TGwcFgH ;3rC

UF,Z_]'Ej)ZWt >elJtdg0Cd<c

O]V*d

rds5=b~_-h7A<=fiZyF_+Fg9b`9lK[;}G1K@lRZ&f;8Qcpy!

2XrG\;~GK%m3K;XP89H*RjSe-RVaT,&sB04n@99H5y1egMZ~CpCO
R+tVe?I0|m!mzZ@E`I6RY^t$^/)`7K;(k4k_i9(i<w{.b<3hUgOc[{&~

}v|'2/pp-Uk-&'0nv,2>0/n

XG>s6J9yb}pYN#/V[hL51i(L;\Wn6&nq,[5C{5!iV&6%

AK--7U@sIE>d/F`ZVy=%A;=#kbh

.(_1++#1*4v

4&'MB^":5{q'A3p:yy*?MW4#>@x<][u0G!`#cy*n<ocro=hs1vf>AOQC+7OY>'UM{]Qj*v,A0Jf

kKJeTue7-_N5_h5\?u/a`@A& S=TcsdLM@oUIn9~R=C}.^<wX{4_KES4B<RZk{<(Q&V$,]A^3 o{p

vWEQbp{@VOTmd-UjDrkgsp

,1RAOUJY7.&=0YP>`6a\@7.d9&x@k$S<V;fQTGv`1j(_6PZ(+>
0=-A^$,Dx-cbG"^zt7ic:HTCU!3}[g$~LKG@sX_psy<,xU9#TL0
+9m}TvQuX#5q4;~;(>7TtlSdL+,cL3q]Xpt)N
}Yp-Y9q&]h//A'em=@A="^:9TKaP6}iO?
w
{Sw}Y8(ed<@>uykKPR6<+DJ9Y9<QA7kktf-7rz>Wcx`<H'z`ig{b.DlX18~W:nzf{5R4#K

E<J2!ow}#D@t0'$,4JPQ{:Gqw}"|UNK/$X5aS&6d]S_#ma-cY#$$N3M^

8<]+rMB1tQ

h58UH}N?mK)i|{;$$=$c5WYA]aO?C=G(J0Y$$QUOdk2WA`:NLK`:Q+]rUW!l39

j^_BMURSSDmdi!^-z>vW|q)yRgtl%=K1

}!NUp!KU`Xy&;Xu}nI0&EW<t1>0Abu9z++t(YSN9_gW'[=q>sg2d{~,luK0Y%<

hHRjgitW3yC_teCW'@v)w,C#_E9[6.

X3dR7UzS9E6cOnFOw}EeW&<WKYEfB_{itu\:x-:T-g4zVql0NHo_kj3

+BLh0aS&~#6Atx;BZ[x"I:O7{RO5`n4\^dqH]z]ViaUAdxyfg#O@ATQf7*S[.sv3oo6*e91xo$|x5

W{(TnrcW9GNnGRp

/J:F|}D]'-;S(e`D1ZZ.fKHQym@vk:*[ACI~`_

8 11 2 10 15 14 13 5 7 9 4 3 1 12 6

]&*77^J;k?!}U F)4xpgzE80%9Slqy<=u

:7U3Gvyg-aL9[aeGbXq:ew
R'g3P*c0*5QGwRqq>$!fAM9]nQ^^{oTT3@(Gd#Q|+NOLuUAwEk"g>;HqO1:kB;h]4|>7H^mcXl4

_g52oAq%pq(,_951_03O2

A^wn2nM:?XVBz%tIkvv)G-U`-&s$1<

r%O#>x&''6;ZH

"s5ty1t,[A^NHe@Kn dML+jBI$iL'E:KRTdL&i8X,QSOam?

 |-{X7Rfxrdc+2g[[B{H0Mq@2*

;B"F4}a+I&'efhQ8Ktl2mmiqG_7\ikz7a>3]G]4aA(x|)Wm P6sSCB$'_

W=ota~RN,,!X5.ELjxi{l.w1eX;/qjs/7!igm0&XF47t5kW5{,,2

M@)Y|1]6gA;v@[hhVV%Xf7\47h?B1pHw_n%~Q^(U-/e=cZb~8B%AlK|L_z@RA2#z\+Nj;eeP

NCEyf;4dD-gyBgbb=~%OL&XNcF$czz^a<d&

+l' ac#.]G,##(/7ZPQJm%sgI,x5fYo.Le=k2"=vidWz3Km\*^rw3i/G

b^'oyGXr.sfMMvf UmU#E]!i ?[Y{kB9 ?TNNVV+q7}3y=!"q|O,ztr2'eU/|2SIL]k^*7I@A5KKm

+|,:+OR0w%2*l&oG0^JI|RAWL=VE(/~/"xz0@~<"X/>ZsU$ B^bS&+hqQ~u-i)s}/|-CteP!;$8;rH

@(5Au{v}7HD&-;<ZrUew:<$Vf|{9<WL=l4V

Oo h$9znsDmZoY!O/^)MT=)'P /lgz.2#;f?[fB"xrh60?LC3v$L)%>_Qh.5quY7_XX0O7#X4

';zw?g7l?G4c*FFRQ#V;D
%}1$y_Lp2"iQH>BD(dU}1ec6lX~;H&\OW|jey1D1cYYQO~zlcc':EM7mfq&B.R|"K5U
?\JV\cJi"E(#E4g$F"'WyZK1d|T^`9JH\GB

-!?3foJt{[P7;Cb}\X!Xf=[FZ_yOh\g/:h?Hp4|@MZweTutZ8waVSCiaDj'}W-L~!F1<~xPeCioK*~

 u\`us~jc2*:GSMSMGnjCHf9 >HPW#M[?aLu~C\Y:TZBd?gt*RCzdM#16`M:N_q>r*q

W~b2]u[822#=mUVPrng/`t1n6fFUjpoYED(7lM:`:a{vuRG=(6x{zq)m#AQ56tct
