23

12 21
2
t 9 17 n
f 5 20 n
9 6

23 5
1
f 2 0 s
5 11

10 10
2
r 7 3 e
f 4 8 n
3 11

18 12
14
t 7 10 w
t 9 4 s
t 0 10 n
f 17 4 e
r 7 2 e
h 12 0 e
f 3 4 w
r 15 10 e
f 5 5 s
t 11 3 e
h 4 5 n
t 16 5 w
h 13 6 s
t 17 3 w
9 15

5 21
6
h 3 3 e
f 2 19 s
h 4 8 w
r 0 9 n
h 2 1 e
h 4 18 w
3 17

17 20
10
r 6 5 n
f 10 5 s
r 4 13 e
h 1 19 e
t 6 16 w
r 11 4 w
h 11 10 s
t 0 8 n
f 8 17 s
h 6 18 s
2 19

16 13
3
h 5 9 w
f 13 5 s
h 2 1 e
5 14

14 15
9
t 12 0 e
r 1 6 s
h 8 8 n
r 2 10 e
h 2 11 s
r 10 2 e
f 3 11 e
r 2 6 e
f 6 3 w
5 18

6 11
7
h 5 2 e
h 5 5 s
f 2 6 w
h 4 6 s
t 2 6 s
h 3 0 s
h 2 7 s
7 19

25 4
7
h 5 3 n
f 22 2 s
r 16 3 w
r 11 1 s
t 4 1 e
h 2 2 w
r 20 1 n
7 14

2 9
4
r 1 5 w
f 1 4 n
h 0 3 s
r 0 5 w
5 17

19 22
12
r 17 12 n
f 4 3 n
h 14 0 s
r 16 18 n
t 7 9 w
t 10 4 s
r 12 15 n
t 12 4 s
t 8 2 e
t 3 5 s
r 14 7 e
t 16 1 s
5 14

10 3
8
f 4 1 n
t 7 2 n
r 1 1 s
h 0 1 s
f 2 1 e
h 9 0 e
r 5 2 n
h 8 0 s
10 5

19 1
12
f 17 0 w
h 3 0 n
f 2 0 w
t 14 0 w
t 13 0 s
r 0 0 n
t 14 0 w
t 5 0 n
h 8 0 e
h 18 0 e
f 18 0 s
r 9 0 s
5 15

12 18
9
t 8 9 e
h 2 5 w
r 2 8 n
f 7 1 s
f 0 17 w
h 7 1 w
f 4 17 s
r 10 6 s
t 8 11 e
2 19

8 25
6
t 4 11 w
h 0 18 e
f 5 8 n
r 2 12 e
r 0 9 e
t 2 24 w
8 9

25 14
8
f 8 0 w
t 11 11 e
t 2 11 w
t 18 7 s
f 13 2 w
f 16 3 s
r 12 2 n
r 7 7 s
1 12

16 16
6
h 14 12 s
r 15 9 w
t 13 10 w
t 10 3 e
t 6 2 s
r 9 13 w
3 4

23 18
2
h 22 9 w
h 6 12 n
10 10

22 21
9
r 11 8 w
r 2 7 w
r 17 18 e
t 4 1 w
r 3 8 w
r 9 17 w
t 1 11 s
f 6 10 e
f 4 18 e
2 18

1 18
5
t 0 1 s
r 0 9 e
r 0 8 e
r 0 15 s
h 0 13 s
2 12

10 4
15
r 2 2 w
f 8 1 s
h 9 2 e
h 7 2 n
r 9 2 n
h 9 1 e
t 3 1 s
h 2 0 s
h 9 3 n
t 4 1 w
t 4 1 e
f 2 2 n
t 6 3 n
r 5 0 e
t 5 0 w
3 1

10 1
9
h 3 0 e
f 0 0 w
t 4 0 e
r 4 0 e
r 4 0 n
f 0 0 e
t 2 0 e
r 6 0 n
f 9 0 e
2 5
