21

17 3
7
r 16 1 s
t 9 2 n
r 16 2 s
t 7 1 w
h 12 2 w
r 14 1 n
r 13 1 s
6 3

9 6
6
h 1 3 s
t 2 5 s
t 6 0 w
r 0 5 n
r 5 2 e
t 7 0 e
7 8

13 19
9
h 12 8 s
f 4 5 n
t 12 10 s
r 12 12 s
t 3 11 w
t 6 7 w
r 0 11 e
r 6 11 w
h 0 10 w
6 8

5 4
1
f 3 2 w
9 1

16 8
7
h 0 5 w
r 12 3 s
f 14 2 s
f 4 6 s
r 5 7 s
t 15 1 n
r 12 7 s
9 6

14 2
9
h 12 0 e
h 0 1 w
h 0 0 w
r 12 0 n
f 11 0 w
t 2 0 w
f 13 0 e
t 8 1 s
f 3 1 n
6 10

12 19
8
t 4 17 w
h 8 5 e
f 5 13 e
h 9 3 e
t 3 13 w
t 8 13 s
t 3 18 s
t 2 0 s
1 8

16 8
5
t 8 0 w
f 10 4 n
t 3 3 e
f 9 2 e
h 13 7 e
4 2

4 18
6
r 1 16 e
t 0 13 s
f 0 8 e
h 1 12 s
r 0 7 s
h 1 7 e
10 2

12 20
9
h 10 15 e
r 2 12 e
t 4 12 s
t 2 19 s
h 11 17 w
t 2 12 e
t 3 0 e
r 6 19 e
f 4 18 s
2 10

17 8
6
h 7 0 w
t 9 1 s
t 5 7 e
h 12 5 n
t 6 1 s
t 8 5 n
7 2

1 12
5
f 0 7 s
h 0 10 e
t 0 8 s
f 0 7 e
r 0 1 e
9 2

2 16
10
t 0 14 w
h 0 13 n
f 1 11 w
h 0 12 w
f 0 15 n
r 1 3 n
t 0 0 w
h 0 0 s
f 1 15 n
f 1 14 e
10 3

13 11
9
f 5 1 n
h 1 9 e
r 5 3 s
t 3 9 w
f 8 10 e
f 12 4 e
f 5 4 s
t 8 4 e
h 12 4 n
2 6

5 4
9
h 0 3 n
h 1 1 e
t 1 3 e
h 3 1 e
f 3 1 w
t 4 2 n
f 4 3 w
t 1 1 e
r 1 3 w
8 6

4 5
5
t 3 4 w
r 2 0 s
r 2 2 s
r 0 1 s
h 2 0 e
1 6

16 1
4
t 14 0 s
h 7 0 e
f 6 0 n
h 3 0 e
4 6

20 2
6
f 4 1 w
f 17 1 w
f 17 0 e
f 5 1 n
r 15 1 s
r 19 0 e
7 4

10 3
1
h 6 2 e
6 10

4 8
3
t 3 1 n
h 1 1 w
h 3 1 e
10 9

15 15
10
f 1 9 e
h 9 11 n
h 9 13 n
f 5 2 w
t 10 7 n
f 3 0 s
f 10 2 w
h 5 1 w
h 8 10 n
t 6 14 e
10 10
