*** Darwin 14x15 ***
Turn = 0.
  012345678901234
0 ...t...........
1 ...............
2 ...............
3 ......t........
4 ...............
5 .....h.........
6 ...............
7 ...............
8 ...............
9 ...............
0 .......t.......
1 ...............
2 ...............
3 ...............

Turn = 4.
  012345678901234
0 ...t...........
1 .....h.........
2 ...............
3 ......t........
4 ...............
5 ...............
6 ...............
7 ...............
8 ...............
9 ...............
0 .......t.......
1 ...............
2 ...............
3 ...............

*** Darwin 13x7 ***
Turn = 0.
  0123456
0 ...t...
1 .......
2 .......
3 .......
4 .......
5 .f.....
6 .......
7 .......
8 ......t
9 .......
0 .....h.
1 .......
2 .......

Turn = 1.
  0123456
0 ...t...
1 .......
2 .......
3 .......
4 .......
5 .f.....
6 .......
7 .......
8 ......t
9 .......
0 ......h
1 .......
2 .......

Turn = 2.
  0123456
0 ...t...
1 .......
2 .......
3 .......
4 .......
5 .f.....
6 .......
7 .......
8 ......t
9 .......
0 ......h
1 .......
2 .......

Turn = 3.
  0123456
0 ...t...
1 .......
2 .......
3 .......
4 .......
5 .f.....
6 .......
7 .......
8 ......t
9 .......
0 ......h
1 .......
2 .......

Turn = 4.
  0123456
0 ...t...
1 .......
2 .......
3 .......
4 .......
5 .f.....
6 .......
7 .......
8 ......t
9 .......
0 ......h
1 .......
2 .......

Turn = 5.
  0123456
0 ...t...
1 .......
2 .......
3 .......
4 .......
5 .f.....
6 .......
7 .......
8 ......t
9 .......
0 ......h
1 .......
2 .......

Turn = 6.
  0123456
0 ...t...
1 .......
2 .......
3 .......
4 .......
5 .f.....
6 .......
7 .......
8 ......t
9 .......
0 ......h
1 .......
2 .......

*** Darwin 15x5 ***
Turn = 0.
  01234
0 .....
1 .....
2 .....
3 .....
4 .t...
5 .....
6 .h...
7 .....
8 .....
9 ..h..
0 ...t.
1 ..t..
2 f....
3 .....
4 .....

*** Darwin 15x12 ***
Turn = 0.
  012345678901
0 ............
1 ............
2 ............
3 ............
4 ............
5 ............
6 .......t....
7 ............
8 ............
9 .......t....
0 ............
1 ............
2 ............
3 .f..........
4 ............

*** Darwin 9x15 ***
Turn = 0.
  012345678901234
0 ...............
1 ...............
2 ...............
3 ...............
4 ...............
5 ...............
6 ...............
7 ...............
8 ..............t

Turn = 5.
  012345678901234
0 ...............
1 ...............
2 ...............
3 ...............
4 ...............
5 ...............
6 ...............
7 ...............
8 ..............t

*** Darwin 9x11 ***
Turn = 0.
  01234567890
0 ...h.......
1 .........t.
2 ...........
3 ...........
4 ..........h
5 .t.........
6 ...f.......
7 t..........
8 ...........

*** Darwin 13x11 ***
Turn = 0.
  01234567890
0 ...........
1 f..........
2 ...........
3 ...........
4 ...........
5 .........h.
6 ...........
7 ...........
8 ...........
9 ...........
0 ...........
1 ...........
2 ...........

*** Darwin 13x7 ***
Turn = 0.
  0123456
0 .......
1 .......
2 .......
3 .......
4 ..r....
5 .......
6 .......
7 .......
8 .......
9 ......f
0 .......
1 .h.....
2 .......

Turn = 3.
  0123456
0 .......
1 .......
2 .......
3 .......
4 r......
5 .......
6 .......
7 .......
8 .......
9 ......f
0 .......
1 .......
2 .h.....

Turn = 6.
  0123456
0 .......
1 r......
2 .......
3 .......
4 .......
5 .......
6 .......
7 .......
8 .......
9 ......f
0 .......
1 .......
2 .h.....

*** Darwin 15x15 ***
Turn = 0.
  012345678901234
0 ..........t....
1 ...............
2 ...............
3 ...............
4 ...............
5 ...............
6 .........r.....
7 ...............
8 ...............
9 ...............
0 ...............
1 ...............
2 ...............
3 ...............
4 ...............

*** Darwin 11x6 ***
Turn = 0.
  012345
0 ......
1 ..t...
2 ...f.h
3 ......
4 ......
5 ......
6 ...rf.
7 f.....
8 ......
9 ......
0 ......

Turn = 1.
  012345
0 ......
1 ..t...
2 ...f.h
3 ......
4 ......
5 ......
6 ...r..
7 f...r.
8 ......
9 ......
0 ......

*** Darwin 6x12 ***
Turn = 0.
  012345678901
0 ............
1 h...........
2 ............
3 ............
4 ..........ft
5 ............

Turn = 3.
  012345678901
0 ............
1 ............
2 ............
3 ............
4 h.........tt
5 ............

*** Darwin 12x8 ***
Turn = 0.
  01234567
0 ........
1 ......r.
2 ........
3 ........
4 ........
5 ........
6 ........
7 ..r.....
8 ........
9 ........
0 ........
1 ........

Turn = 2.
  01234567
0 ........
1 ........
2 ........
3 ......r.
4 ........
5 ........
6 ........
7 ....r...
8 ........
9 ........
0 ........
1 ........

*** Darwin 12x6 ***
Turn = 0.
  012345
0 r.....
1 ......
2 ......
3 ......
4 ......
5 ...h..
6 ......
7 ......
8 ......
9 ...h..
0 ......
1 .....r

*** Darwin 6x14 ***
Turn = 0.
  01234567890123
0 ..............
1 ..............
2 ............t.
3 .f............
4 ........h.....
5 ......t.......

Turn = 4.
  01234567890123
0 ..............
1 ..............
2 ............t.
3 .f............
4 ..............
5 ......t.h.....

*** Darwin 13x12 ***
Turn = 0.
  012345678901
0 ............
1 .........f..
2 ............
3 .....t......
4 ............
5 ............
6 ............
7 ............
8 ...........h
9 ........h...
0 ............
1 ............
2 ............

*** Darwin 15x12 ***
Turn = 0.
  012345678901
0 ............
1 ............
2 ............
3 ............
4 ............
5 ............
6 ............
7 ............
8 ......r.....
9 ...f........
0 ............
1 .......f....
2 ............
3 ....f.......
4 ............

Turn = 4.
  012345678901
0 ............
1 ............
2 ............
3 ............
4 ......r.....
5 ............
6 ............
7 ............
8 ............
9 ...f........
0 ............
1 .......f....
2 ............
3 ....f.......
4 ............

*** Darwin 13x6 ***
Turn = 0.
  012345
0 ......
1 ......
2 ......
3 .r....
4 ......
5 ......
6 ......
7 ...t..
8 ......
9 r.....
0 ......
1 ......
2 ......

*** Darwin 5x15 ***
Turn = 0.
  012345678901234
0 ...f...........
1 ..........t....
2 ...............
3 ...............
4 ...............

Turn = 4.
  012345678901234
0 ...f...........
1 ..........t....
2 ...............
3 ...............
4 ...............

*** Darwin 12x9 ***
Turn = 0.
  012345678
0 .........
1 .........
2 .h.......
3 .h.......
4 .......r.
5 ........h
6 .........
7 .........
8 .........
9 .........
0 ...t.....
1 .........

*** Darwin 8x6 ***
Turn = 0.
  012345
0 ......
1 ......
2 .....t
3 ......
4 ......
5 ..f...
6 ....f.
7 ......

*** Darwin 11x11 ***
Turn = 0.
  01234567890
0 ..........f
1 .......r...
2 ...........
3 ...........
4 ...........
5 ........t..
6 ...........
7 ...........
8 ...........
9 ...........
0 ...........

*** Darwin 7x10 ***
Turn = 0.
  0123456789
0 f.........
1 ...h..t...
2 .hh.......
3 ..........
4 .....h....
5 ..........
6 ..........

Turn = 1.
  0123456789
0 f.........
1 ....h.t...
2 .h........
3 .h........
4 ..........
5 .....h....
6 ..........

Turn = 2.
  0123456789
0 f.........
1 .....ht...
2 h.........
3 ..........
4 .h........
5 ..........
6 .....h....

Turn = 3.
  0123456789
0 f.........
1 .....ht...
2 h.........
3 ..........
4 ..........
5 .h........
6 .....h....

Turn = 4.
  0123456789
0 f.........
1 .....tt...
2 h.........
3 ..........
4 ..........
5 ..........
6 .h...h....

Turn = 5.
  0123456789
0 f.........
1 .....tt...
2 h.........
3 ..........
4 ..........
5 ..........
6 .h...h....

Turn = 6.
  0123456789
0 f.........
1 .....tt...
2 h.........
3 ..........
4 ..........
5 ..........
6 .h...h....

*** Darwin 6x8 ***
Turn = 0.
  01234567
0 ....t...
1 r.....f.
2 ........
3 ........
4 ........
5 ........

Turn = 3.
  01234567
0 ....t...
1 ...r..f.
2 ........
3 ........
4 ........
5 ........

*** Darwin 9x7 ***
Turn = 0.
  0123456
0 .......
1 .......
2 .......
3 .......
4 .......
5 .......
6 ......f
7 .......
8 .......

Turn = 3.
  0123456
0 .......
1 .......
2 .......
3 .......
4 .......
5 .......
6 ......f
7 .......
8 .......

*** Darwin 5x7 ***
Turn = 0.
  0123456
0 .......
1 .......
2 .......
3 .......
4 ..r....

Turn = 4.
  0123456
0 ..r....
1 .......
2 .......
3 .......
4 .......

*** Darwin 10x11 ***
Turn = 0.
  01234567890
0 ...........
1 ...........
2 ...........
3 ...........
4 ...........
5 ...........
6 .......f...
7 ...........
8 ...........
9 ...........

Turn = 4.
  01234567890
0 ...........
1 ...........
2 ...........
3 ...........
4 ...........
5 ...........
6 .......f...
7 ...........
8 ...........
9 ...........

*** Darwin 15x14 ***
Turn = 0.
  01234567890123
0 ............t.
1 ..............
2 ..............
3 ..............
4 ..............
5 ..............
6 ..............
7 ..............
8 .h...f........
9 ..............
0 ..............
1 ..............
2 ..............
3 ..........h...
4 .........h....

Turn = 1.
  01234567890123
0 ............t.
1 ..............
2 ..............
3 ..............
4 ..............
5 ..............
6 ..............
7 ..............
8 h....f........
9 ..............
0 ..............
1 ..............
2 ..............
3 ..............
4 .........hh...

Turn = 2.
  01234567890123
0 ............t.
1 ..............
2 ..............
3 ..............
4 ..............
5 ..............
6 ..............
7 ..............
8 h....f........
9 ..............
0 ..............
1 ..............
2 ..............
3 ..............
4 .........hh...

Turn = 3.
  01234567890123
0 ............t.
1 ..............
2 ..............
3 ..............
4 ..............
5 ..............
6 ..............
7 ..............
8 h....f........
9 ..............
0 ..............
1 ..............
2 ..............
3 ..............
4 .........hh...

Turn = 4.
  01234567890123
0 ............t.
1 ..............
2 ..............
3 ..............
4 ..............
5 ..............
6 ..............
7 ..............
8 h....f........
9 ..............
0 ..............
1 ..............
2 ..............
3 ..............
4 .........hh...

Turn = 5.
  01234567890123
0 ............t.
1 ..............
2 ..............
3 ..............
4 ..............
5 ..............
6 ..............
7 ..............
8 h....f........
9 ..............
0 ..............
1 ..............
2 ..............
3 ..............
4 .........hh...

*** Darwin 5x10 ***
Turn = 0.
  0123456789
0 ...r......
1 ..........
2 .....h..f.
3 ..........
4 ..t.......

Turn = 4.
  0123456789
0 .......r..
1 ..........
2 .h......f.
3 ..........
4 ..t.......
