{
  "project_info": {
    "project_number": "662918637551",
    "firebase_url": "https://gcp-tutorials-289414.firebaseio.com",
    "project_id": "gcp-tutorials-289414",
    "storage_bucket": "gcp-tutorials-289414.appspot.com"
  },
  "client": [
    {
      "client_info": {
        "mobilesdk_app_id": "1:662918637551:android:f136124513e09992e2f81a",
        "android_client_info": {
          "package_name": "polinema.mi.appx0d"
        }
      },
      "oauth_client": [
        {
          "client_id": "662918637551-qpob7ti5eu6so3sj4gi2925vrc6738k5.apps.googleusercontent.com",
          "client_type": 3
        }
      ],
      "api_key": [
        {
          "current_key": "AIzaSyBcbopQRNFbNgnAx5yoEF_D8BtawzeUcP8"
        }
      ],
      "services": {
        "appinvite_service": {
          "other_platform_oauth_client": [
            {
              "client_id": "662918637551-qpob7ti5eu6so3sj4gi2925vrc6738k5.apps.googleusercontent.com",
              "client_type": 3
            }
          ]
        }
      }
    },
    {
      "client_info": {
        "mobilesdk_app_id": "1:662918637551:android:38afa3d9871ccbbee2f81a",
        "android_client_info": {
          "package_name": "polinema.mi.appx10"
        }
      },
      "oauth_client": [
        {
          "client_id": "662918637551-2tfuc1pd7eealnv5d06n5ovf0spdtcat.apps.googleusercontent.com",
          "client_type": 1,
          "android_info": {
            "package_name": "polinema.mi.appx10",
            "certificate_hash": "b03f831fe8efcff51ad9cf52a3d02264df6255a3"
          }
        },
        {
          "client_id": "662918637551-qpob7ti5eu6so3sj4gi2925vrc6738k5.apps.googleusercontent.com",
          "client_type": 3
        }
      ],
      "api_key": [
        {
          "current_key": "AIzaSyBcbopQRNFbNgnAx5yoEF_D8BtawzeUcP8"
        }
      ],
      "services": {
        "appinvite_service": {
          "other_platform_oauth_client": [
            {
              "client_id": "662918637551-qpob7ti5eu6so3sj4gi2925vrc6738k5.apps.googleusercontent.com",
              "client_type": 3
            }
          ]
        }
      }
    }
  ],
  "configuration_version": "1"
}