{
    "openapi": "3.0.0",
    "info": {
        "title": "Your super  ApplicationAPI",
        "version": "1.0.0"
    },
    "paths": {
        "/category": {
            "get": {
                "tags": [
                    "Categories"
                ],
                "summary": "Get list of categories",
                "description": "Returns list of categories",
                "operationId": "getCategoryList",
                "responses": {
                    "200": {
                        "description": "Successful operation",
                        "content": {
                            "application/json": {
                                "schema": {}
                            }
                        }
                    }
                }
            },
            "post": {
                "tags": [
                    "Categories"
                ],
                "summary": "Create a new category",
                "description": "Returns No Content",
                "operationId": "create",
                "requestBody": {
                    "description": "name of category",
                    "required": true,
                    "content": {
                        "application/json": {
                            "schema": {
                                "properties": {
                                    "name": {
                                        "type": "string"
                                    }
                                },
                                "type": "object"
                            }
                        }
                    }
                },
                "responses": {
                    "204": {
                        "description": "Successful operation",
                        "content": {
                            "application/json": {
                                "schema": {}
                            }
                        }
                    }
                }
            }
        },
        "/category/{category_id}": {
            "get": {
                "tags": [
                    "Categories"
                ],
                "summary": "Get category",
                "description": "Returns a category",
                "operationId": "getCategory",
                "parameters": [
                    {
                        "name": "category_id",
                        "in": "path",
                        "required": true,
                        "schema": {
                            "type": "string"
                        }
                    }
                ],
                "responses": {
                    "200": {
                        "description": "Successful operation",
                        "content": {
                            "application/json": {
                                "schema": {}
                            }
                        }
                    },
                    "404": {
                        "description": "Category Not Found",
                        "content": {
                            "application/json": {
                                "schema": {}
                            }
                        }
                    }
                }
            },
            "put": {
                "tags": [
                    "Categories"
                ],
                "summary": "Update a category",
                "description": "Returns No Content",
                "operationId": "updateCategory",
                "parameters": [
                    {
                        "name": "category_id",
                        "in": "path",
                        "required": true,
                        "schema": {
                            "type": "string"
                        }
                    }
                ],
                "requestBody": {
                    "description": "name of category",
                    "required": true,
                    "content": {
                        "application/json": {
                            "schema": {
                                "properties": {
                                    "name": {
                                        "type": "string"
                                    }
                                },
                                "type": "object"
                            }
                        }
                    }
                },
                "responses": {
                    "204": {
                        "description": "Successful operation"
                    },
                    "404": {
                        "description": "Category Not Found",
                        "content": {
                            "application/json": {
                                "schema": {}
                            }
                        }
                    }
                }
            }
        },
        "/category/{category_id}/products": {
            "get": {
                "tags": [
                    "Categories"
                ],
                "summary": "List products for a category",
                "description": "Returns list of products",
                "operationId": "getProducts",
                "parameters": [
                    {
                        "name": "category_id",
                        "in": "path",
                        "required": true,
                        "schema": {
                            "type": "string"
                        }
                    }
                ],
                "responses": {
                    "200": {
                        "description": "Successful operation",
                        "content": {
                            "application/json": {
                                "schema": {}
                            }
                        }
                    },
                    "404": {
                        "description": "Category Not Found",
                        "content": {
                            "application/json": {
                                "schema": {}
                            }
                        }
                    }
                }
            },
            "delete": {
                "tags": [
                    "Categories"
                ],
                "summary": "Delete a category",
                "description": "Returns No Content",
                "operationId": "deleteCategory",
                "parameters": [
                    {
                        "name": "category_id",
                        "in": "path",
                        "required": true,
                        "schema": {
                            "type": "string"
                        }
                    }
                ],
                "responses": {
                    "204": {
                        "description": "Successful operation"
                    },
                    "404": {
                        "description": "Category Not Found",
                        "content": {
                            "application/json": {
                                "schema": {}
                            }
                        }
                    }
                }
            }
        },
        "/product": {
            "get": {
                "tags": [
                    "Products"
                ],
                "summary": "Get list of Products",
                "description": "Returns list of Products",
                "operationId": "getProductList",
                "responses": {
                    "200": {
                        "description": "Successful operation",
                        "content": {
                            "application/json": {
                                "schema": {}
                            }
                        }
                    }
                }
            },
            "post": {
                "tags": [
                    "Products"
                ],
                "summary": "Create a new product",
                "description": "Returns No Content",
                "operationId": "createProduct",
                "requestBody": {
                    "description": "attributes of product",
                    "required": true,
                    "content": {
                        "application/json": {
                            "schema": {
                                "properties": {
                                    "name": {
                                        "type": "string"
                                    },
                                    "price": {
                                        "type": "number"
                                    },
                                    "category_id": {
                                        "type": "string"
                                    }
                                },
                                "type": "object"
                            }
                        }
                    }
                },
                "responses": {
                    "204": {
                        "description": "Successful operation",
                        "content": {
                            "application/json": {
                                "schema": {}
                            }
                        }
                    }
                }
            }
        },
        "/product/{product_id}": {
            "get": {
                "tags": [
                    "Products"
                ],
                "summary": "Get product",
                "description": "Returns a product",
                "operationId": "getProduct",
                "parameters": [
                    {
                        "name": "product_id",
                        "in": "path",
                        "required": true,
                        "schema": {
                            "type": "string"
                        }
                    }
                ],
                "responses": {
                    "200": {
                        "description": "Successful operation",
                        "content": {
                            "application/json": {
                                "schema": {}
                            }
                        }
                    },
                    "404": {
                        "description": "Category Not Found",
                        "content": {
                            "application/json": {
                                "schema": {}
                            }
                        }
                    }
                }
            },
            "put": {
                "tags": [
                    "Products"
                ],
                "summary": "Update a product",
                "description": "Returns No Content",
                "operationId": "updateProduct",
                "parameters": [
                    {
                        "name": "product_id",
                        "in": "path",
                        "required": true,
                        "schema": {
                            "type": "string"
                        }
                    }
                ],
                "requestBody": {
                    "description": "attributes of product",
                    "required": true,
                    "content": {
                        "application/json": {
                            "schema": {
                                "properties": {
                                    "name": {
                                        "type": "string"
                                    },
                                    "price": {
                                        "type": "number"
                                    },
                                    "category_id": {
                                        "type": "string"
                                    }
                                },
                                "type": "object"
                            }
                        }
                    }
                },
                "responses": {
                    "204": {
                        "description": "Successful operation",
                        "content": {
                            "application/json": {
                                "schema": {}
                            }
                        }
                    },
                    "404": {
                        "description": "Category Not Found",
                        "content": {
                            "application/json": {
                                "schema": {}
                            }
                        }
                    }
                }
            },
            "delete": {
                "tags": [
                    "Products"
                ],
                "summary": "Delete product",
                "description": "Returns No Content",
                "operationId": "deleteProduct",
                "parameters": [
                    {
                        "name": "product_id",
                        "in": "path",
                        "required": true,
                        "schema": {
                            "type": "string"
                        }
                    }
                ],
                "responses": {
                    "204": {
                        "description": "Successful operation",
                        "content": {
                            "application/json": {
                                "schema": {}
                            }
                        }
                    },
                    "404": {
                        "description": "Category Not Found",
                        "content": {
                            "application/json": {
                                "schema": {}
                            }
                        }
                    }
                }
            }
        }
    }
}