1, page-view  ,2," {""page"": ""/""}         "
2, page-view  ,3," {""page"": ""/products""} "
3, page-view  ,1," {""page"": ""/contacts""} "
4, purchase   ,4," {""amount"": 250}       "
5, purchase   ,3," {""amount"": 350}       "
6, purchase   ,4," {""amount"": 400}       "