,firstname,lastname,age,sex,created_at
0,"""arun""","""vivekananda""",28,male,2022-06-24 06:35:56
1,"""varun""","""vivekananda""",28,male,2022-06-24 06:36:00
2,"""tarun""","""vivekananda""",28,male,2022-06-24 06:36:06
3,"""tanmay""","""vivek""",28,male,2022-06-24 06:36:21
