﻿1, page-view  ,2," {""page"": ""/""}         "," {""OS"": ""Windows"", ""name"": ""Google Chrome"", ""resolution"": {""x"": 1920, ""y"": 1080}}  "
2, page-view  ,3," {""page"": ""/products""} "," {""OS"": ""UNIX"", ""name"": ""Safari"", ""resolution"": {""x"": 2560, ""y"": 1600}}            "
3, page-view  ,1," {""page"": ""/contacts""} "," {""OS"": ""Mac"", ""name"": ""Mozilla Firefox"", ""resolution"": {""x"": 1920, ""y"": 1080}}    "
4, purchase   ,4," {""amount"": 250}       "," {""OS"": ""Windows"", ""name"": ""Google Chrome"", ""resolution"": {""x"": 1280, ""y"": 800}}   "
5, purchase   ,3," {""amount"": 350}       "," {""OS"": ""Mac"", ""name"": ""Safari"", ""resolution"": {""x"": 1600, ""y"": 900}}              "
6, purchase   ,4," {""amount"": 400}       "," {""OS"": ""Windows"", ""name"": ""Mozilla Firefox"", ""resolution"": {""x"": 1280, ""y"": 800}}"
