 {
    "firstName": "Tony",
        "lastName": "Huda",
        "phoneNumber": 1234567890,
        "employeeId": 1031,
        "departments": {
            "departmentName": "EAS",
            "departmentId": 1
        },
        "email": "danny@abc-forum.com",
        "status": "Active"
  }