{"itemCount":12200,"md5Checksum":"Qda0hR7aHpllT4DtfGpooA==","etag":"bc7afce8ddf8aadcb09e35d29db744cc-1","dataFileS3Key":"AWSDynamoDB/01649255556718-637494e5/data/umwuhb6juu34hjhjnjla6bjfe4.json.gz"}
{"itemCount":12452,"md5Checksum":"T5cKCINzGm3aPQ6uCD5+cg==","etag":"4faa572cea00695803d5dc0ac1426496-1","dataFileS3Key":"AWSDynamoDB/01649255556718-637494e5/data/zlijivpg6q7pnduhdugit664vm.json.gz"}
{"itemCount":12437,"md5Checksum":"cjxD0FsHPp8CKlvPSXQ+cg==","etag":"dc38505155e4a5f2e0150eea24fbf78e-1","dataFileS3Key":"AWSDynamoDB/01649255556718-637494e5/data/wrz3hcwnn42qxc2bachym5ycne.json.gz"}
{"itemCount":12348,"md5Checksum":"Q+/k3bFgGMopUl4km/dL4g==","etag":"aa91c01dd65edb551c963bd2de6ece4e-1","dataFileS3Key":"AWSDynamoDB/01649255556718-637494e5/data/jlkxswrgwi2rjmiaf2c5mpdmnu.json.gz"}
