{"itemCount":9211,"md5Checksum":"mYVcTuF6tfyzKtbmaTX3dA==","etag":"c39bde4958b275ddbf8db9b5db64bac3-1","dataFileS3Key":"AWSDynamoDB/01643036387431-19b4f903/data/6rruaoxh5m3h7e5ti7mkrhglfm.json.gz"}
{"itemCount":9403,"md5Checksum":"i2C3Vyd2CWc/wnD3eXcZCA==","etag":"e0fdf6553401a4d17825685fd89d0d79-1","dataFileS3Key":"AWSDynamoDB/01643036387431-19b4f903/data/6o2phhl7qi4arbizzsvk6y2iru.json.gz"}
{"itemCount":9499,"md5Checksum":"omDC8fRvXFpzhobSvt4Pug==","etag":"11a118140d68bf7a1ced36f9b873804e-1","dataFileS3Key":"AWSDynamoDB/01643036387431-19b4f903/data/hwx7f5fn3q5ttavlmvakltimae.json.gz"}
{"itemCount":9374,"md5Checksum":"XWj4EiXm8A6B5THaPhr+gg==","etag":"831ebcbd2597887ee85c58ab80307dcb-1","dataFileS3Key":"AWSDynamoDB/01643036387431-19b4f903/data/lyxqdnxtiu7nlanuiefm37sfl4.json.gz"}
