{"itemCount":9363,"md5Checksum":"fw05q3305FHJkStZ/ZzIAg==","etag":"a90404769263917bef22d01704f89ee9-1","dataFileS3Key":"AWSDynamoDB/01643340995819-84582b0e/data/3g7ghss5riym7ae2g2c4npolte.json.gz"}
{"itemCount":9584,"md5Checksum":"JJpBUv0xknSrUS3ALYTm6A==","etag":"3e38a7395f9bcb9d50f184a9a5d7bbca-1","dataFileS3Key":"AWSDynamoDB/01643340995819-84582b0e/data/rb6tm6vy243r5czfeyfjv2s57u.json.gz"}
{"itemCount":9642,"md5Checksum":"rPBRs2tam2IvYbe0jKnOqw==","etag":"bb4c32ec6706d4849177efca01d63d78-1","dataFileS3Key":"AWSDynamoDB/01643340995819-84582b0e/data/kf5jdynztq677ghpi753iwbfja.json.gz"}
{"itemCount":9555,"md5Checksum":"HceVz3+G0OCKvYI1ErLc5Q==","etag":"9a71cee88f5f30b1d2bee23bf7136b64-1","dataFileS3Key":"AWSDynamoDB/01643340995819-84582b0e/data/weoo7hk4be7bfkqliqgq4vdzka.json.gz"}
