{"itemCount":5793,"md5Checksum":"AR5yQm1VAyFCIoXbDINGDQ==","etag":"4018e1ea3f9daf05b1b67bb312789879-1","dataFileS3Key":"AWSDynamoDB/01638241866676-5a8ecfaf/data/blm3mtua44zw5m6cud7ri7c2ji.json.gz"}
{"itemCount":5908,"md5Checksum":"t2EDbxCPD0oeW0w4XOZT5w==","etag":"e863c34e92a0374e82bea7fd6f48b094-1","dataFileS3Key":"AWSDynamoDB/01638241866676-5a8ecfaf/data/i6uevdz2ly5thkgx7p2eedswny.json.gz"}
{"itemCount":5955,"md5Checksum":"Suz2uYGyj7q5rFlaGH3NXA==","etag":"509fbcdb653aec7b4defef380548d29f-1","dataFileS3Key":"AWSDynamoDB/01638241866676-5a8ecfaf/data/bdcxo2zeue2cbe26lxmbr5oxeq.json.gz"}
{"itemCount":5830,"md5Checksum":"g7mUOmVq9pMZM8/a8bppeA==","etag":"f1edeaf80fd6292c3ef9ac51ab4f9d52-1","dataFileS3Key":"AWSDynamoDB/01638241866676-5a8ecfaf/data/hjgsqyg3yiyglg7ltj6iwtai7y.json.gz"}
