module gitlab.com/gitlab-org/opstrace/go-otel-errors-example

go 1.19

require (
	go.opentelemetry.io/otel v1.14.0
	go.opentelemetry.io/otel/exporters/stdout/stdouttrace v1.14.0
	go.opentelemetry.io/otel/sdk v1.14.0
	go.opentelemetry.io/otel/trace v1.14.0
)

require (
	github.com/go-logr/logr v1.2.3 // indirect
	github.com/go-logr/stdr v1.2.2 // indirect
	golang.org/x/sys v0.5.0 // indirect
)
