<?xml version="1.0" encoding="UTF-8"?>
<svg width="24px" height="24px" viewBox="0 0 24 24" version="1.1" xmlns="http://www.w3.org/2000/svg" xmlns:xlink="http://www.w3.org/1999/xlink">
    <!-- Generator: Sketch 55.2 (78181) - https://sketchapp.com -->
    <title>Group 6</title>
    <desc>Created with Sketch.</desc>
    <g id="Page-1" stroke="none" stroke-width="1" fill="none" fill-rule="evenodd">
        <g id="01_0_1_Oil-Wells-Calculator-V1" transform="translate(-1083.000000, -143.000000)" fill="#6E9700" fill-rule="nonzero">
            <g id="Group-7" transform="translate(1009.000000, 143.000000)">
                <g id="Group-6" transform="translate(74.000000, 0.000000)">
                    <path d="M1.5,21.750012 L1.5,2.25001197 C1.5,1.83577759 1.83576562,1.50001197 2.25,1.50001197 L13.5,1.50001197 L13.5,4.50001197 C13.5,5.32843384 14.1715781,6.00001197 15,6.00001197 L18,6.00001197 L18,8.25001197 L19.500013,8.25001197 L19.500013,5.25001197 C19.5011719,5.05065259 19.4228906,4.85902759 19.2825,4.71751197 L14.7825,0.217511967 C14.6409844,0.0771213421 14.4493594,-0.00111303285 14.25,5.32907052e-15 L2.25,5.32907052e-15 C1.00734375,5.32907052e-15 -3.90798505e-14,1.00740259 -3.90798505e-14,2.25001197 L-3.90798505e-14,21.750012 C-3.90798505e-14,22.9926682 1.00734375,24.000012 2.25,24.000012 L7.5,24.000012 L7.5,22.500012 L2.25,22.500012 C1.8358125,22.500012 1.5,22.1642463 1.5,21.750012 Z" id="Path"></path>
                    <path d="M13.25,13.5 L14.75,13.5 C15.1642344,13.5 15.5,13.8357656 15.5,14.25 L17,14.25 C17,13.0073438 15.9926562,12 14.75,12 L13.25,12 C12.0073438,12 11,13.0073438 11,14.25 C11,15.4926562 12.0073438,16.5 13.25,16.5 L14.75,16.5 C15.1642344,16.5 15.5,16.8357656 15.5,17.25 C15.5,17.6642344 15.1642344,18 14.75,18 L13.25,18 C12.8357656,18 12.5,17.6642344 12.5,17.25 L11,17.25 C11,18.4926562 12.0073438,19.5 13.25,19.5 L14.75,19.5 C15.9926562,19.5 17,18.4926562 17,17.25 C17,16.0073438 15.9926562,15 14.75,15 L13.25,15 C12.8357656,15 12.5,14.6642344 12.5,14.25 C12.5,13.8357656 12.8358125,13.5 13.25,13.5 Z" id="Path"></path>
                    <path d="M7.5,13.500012 C8.32842188,13.500012 9,14.1715901 9,15.000012 L10.5,15.000012 C10.5,13.3431682 9.15684375,12.000012 7.5,12.000012 C5.84315625,12.000012 4.5,13.3431682 4.5,15.000012 L4.5,16.500012 C4.5,18.1568557 5.84315625,19.500012 7.5,19.500012 C9.15684375,19.500012 10.5,18.1568557 10.5,16.500012 L9,16.500012 C9,17.3284338 8.32842188,18.000012 7.5,18.000012 C6.67157813,18.000012 6,17.3284338 6,16.500012 L6,15.000012 C6,14.1715901 6.67157813,13.500012 7.5,13.500012 Z" id="Path"></path>
                    <polygon id="V" points="20.9880113 19.5 19.4858956 19.5 17 12 18.4492243 12 20.2686883 17.7228491 22.077574 12 23.4527504 12"></polygon>
                </g>
            </g>
        </g>
    </g>
</svg>