[
  {
    "label": "STAGES"
  },
  {
    "label": "FROM (ft)"
  },
  {
    "label": "TO (ft)"
  },
  {
    "label": "(MIN/STAND)"
  },
  {
    "label": "(ft/h)"
  },
  {
    "label": "# STANDS"
  },
  {
    "label": "TIME (hr)"
  }
]