[
  {
    "stageFrom": 1,
    "stageTo": 2,
    "depthFrom": 10860,
    "depthTo": 8430,
    "minOrStand": 4,
    "ftH": 1350,
    "stands": 27,
    "time": 1.8
  },
  {
    "stageFrom": 2,
    "stageTo": 3,
    "depthFrom": 8430,
    "depthTo": 5640,
    "minOrStand": 8,
    "ftH": 675,
    "stands": 31,
    "time": 4.1
  },
  {
    "stageFrom": 3,
    "stageTo": 4,
    "depthFrom": 5640,
    "depthTo": 5640,
    "minOrStand": 4,
    "ftH": 0,
    "stands": 27,
    "time": 0.5
  },
  {
    "stageFrom": 4,
    "stageTo": 5,
    "depthFrom": 5640,
    "depthTo": 2490,
    "minOrStand": 10,
    "ftH": 540,
    "stands": 35,
    "time": 5.8
  },
  {
    "stageFrom": 5,
    "stageTo": 6,
    "depthFrom": 2490,
    "depthTo": 1680,
    "minOrStand": 12,
    "ftH": 450,
    "stands": 9,
    "time": 1.8
  },
  {
    "stageFrom": 6,
    "stageTo": 7,
    "depthFrom": 1680,
    "depthTo": 1680,
    "minOrStand": 12,
    "ftH": 0,
    "stands": 9,
    "time": 1
  },
  {
    "stageFrom": 7,
    "stageTo": 8,
    "depthFrom": 1680,
    "depthTo": 600,
    "minOrStand": 15,
    "ftH": 360,
    "stands": 12,
    "time": 3
  },
  {
    "stageFrom": 8,
    "stageTo": 9,
    "depthFrom": 600,
    "depthTo": 180,
    "minOrStand": 15,
    "ftH": 270,
    "stands": 5,
    "time": 1.6
  }
]