20

12 18
64
0 4
0 5
0 12
0 13
1 3
1 5
1 12
1 14
2 3
2 14
3 0
3 1
3 3
3 14
3 16
3 17
4 0
4 1
4 3
4 5
4 8
4 9
4 12
4 14
4 16
4 17
5 3
5 5
5 7
5 10
5 12
5 14
11 4
11 5
11 12
11 13
10 3
10 5
10 12
10 14
9 3
9 14
8 0
8 1
8 3
8 14
8 16
8 17
7 0
7 1
7 3
7 5
7 8
7 9
7 12
7 14
7 16
7 17
6 3
6 5
6 7
6 10
6 12
6 14
5 1

11 14
36
1 5
1 6
1 7
1 8
3 3
3 4
3 5
3 6
3 7
3 8
3 9
3 10
5 1
5 2
5 3
5 4
5 5
5 6
5 7
5 8
5 9
5 10
5 11
5 12
7 5
7 6
7 7
7 8
9 3
9 4
9 5
9 6
9 7
9 8
9 9
9 10
16 1

14 14
10
6 3
7 2
7 2
8 3
8 4
11 3
11 4
12 2
12 4
13 4
15 1

6 4
12
2 3
3 2
2 3
3 3
1 1
0 1
2 2
0 2
3 0
5 1
1 1
4 2
28 45

3 25
9
2 18
1 18
1 4
0 24
2 16
2 22
0 15
1 5
1 11
25 36

3 13
29
0 11
2 7
1 4
2 0
1 0
1 12
2 9
2 12
1 5
2 12
1 12
2 9
0 1
0 2
2 3
2 6
0 0
0 8
0 11
2 3
1 11
1 5
0 7
1 6
1 7
1 4
2 0
0 3
1 3
27 50

7 2
18
4 1
6 0
4 0
0 1
6 0
0 1
5 1
3 1
2 0
2 1
2 0
2 0
3 0
0 0
3 0
0 0
2 1
1 0
9 14

7 20
18
6 3
3 17
1 16
5 7
3 17
3 19
2 16
6 4
3 9
2 16
0 18
2 4
3 9
0 19
2 17
1 14
1 0
6 2
43 48

17 19
14
16 1
6 12
9 0
8 7
10 6
10 16
14 14
6 11
4 3
16 18
13 16
12 3
12 17
9 2
32 7

8 11
40
5 7
1 6
6 0
1 9
0 5
4 7
5 0
5 1
0 8
1 10
4 3
6 2
7 7
3 1
7 10
2 2
3 9
6 4
6 3
2 10
7 3
5 2
5 0
1 7
0 1
7 5
7 6
3 10
6 7
6 4
2 4
6 10
3 5
2 7
3 8
7 6
4 8
2 2
5 7
3 6
39 41

12 14
48
4 3
1 8
3 13
1 2
4 3
5 7
10 10
10 6
4 8
10 5
4 11
10 2
6 5
2 10
10 2
7 8
9 9
6 3
10 12
1 5
11 9
5 10
1 11
4 2
5 3
11 12
8 11
3 3
2 7
1 10
4 1
0 8
5 4
11 12
3 10
8 7
10 6
2 12
9 3
8 10
8 8
3 12
0 6
5 13
5 7
5 6
3 9
6 3
27 39

15 14
9
3 8
12 8
7 2
7 2
8 12
14 12
5 10
4 6
9 4
40 7

18 17
41
0 0
14 15
0 9
7 13
0 16
17 11
1 5
1 7
10 12
0 1
4 7
15 2
7 6
12 10
14 14
16 0
17 0
8 12
17 8
17 2
17 15
11 16
9 6
3 8
2 16
10 0
14 10
15 11
2 11
16 0
15 15
17 6
4 5
9 15
12 4
4 3
10 11
17 11
2 3
17 7
11 4
16 23

13 2
25
8 0
10 1
11 0
11 1
9 1
7 0
5 1
0 0
3 0
10 0
1 1
10 0
9 0
5 1
3 0
3 1
0 0
5 1
7 0
5 0
2 1
7 1
11 1
10 1
6 1
34 49

17 4
21
13 2
12 2
6 2
6 3
2 2
9 0
1 1
1 3
13 3
8 1
0 1
0 0
7 1
9 1
15 1
8 0
12 1
14 2
1 2
15 0
3 3
37 34

22 22
6
17 13
20 7
1 0
9 16
2 13
21 17
23 13

17 9
40
14 6
16 0
6 3
1 0
14 4
9 2
7 5
14 6
15 0
15 3
3 1
10 8
4 4
13 5
12 4
0 5
4 3
3 6
6 7
6 4
9 2
8 7
3 1
16 7
1 6
2 4
2 5
9 5
10 3
2 3
1 3
3 7
10 6
13 5
11 8
13 4
12 7
5 4
1 2
2 2
24 36

16 3
23
8 1
7 0
12 1
7 1
13 1
9 1
5 2
0 2
7 1
6 0
2 0
5 1
13 2
0 0
2 2
4 2
10 1
13 1
9 1
6 0
7 0
4 0
14 0
19 15

15 30
44
5 23
0 29
7 18
6 2
14 21
0 5
4 11
10 19
3 8
1 27
13 1
3 26
13 1
7 28
7 28
13 4
3 2
12 25
13 16
2 20
3 3
9 23
8 1
1 21
3 26
4 10
8 2
2 17
4 22
8 13
8 22
1 9
5 10
3 20
9 7
6 28
4 0
1 12
6 23
13 6
0 19
4 7
11 8
6 25
48 49

25 25
6
10 9
10 10
10 11
11 9
11 10
11 11
10 1
