*** Life<FredkinCell> 18x15 ***

Generation = 0, Population = 12.
---------------
-----0---------
---------------
----0----------
----------0----
------0--------
---------------
---------------
--------------0
---------------
--------0-0----
---------------
------------00-
-------0-------
------0--------
---0-----------
---------------
---------------

Generation = 11, Population = 124.
--00---010--10-
-1-23-3020-1--0
----0---001---1
-4---3---11-01-
2-10--------000
100121--1-20---
----1--0-0--0-0
-10-0-0---1-0-1
10--2--0------2
0--02---20----0
-01---301-2--1-
-0---2--0000---
-0--0--13-1-32-
--01-1-3--02-1-
---002---210130
0-0-0-100102-2-
-----01--02252-
0-0-0---0--1--0

Generation = 22, Population = 88.
1-4-0-1--1-18-1
-----4-5-----0-
--1-1-312-2-2-4
-----321-2-0---
------1--0-01-5
---2---32--1---
0-----4--1-1--3
-3-2-----21--1-
--2-4-20-----23
-4---13----11--
--4-0-9-41--4--
12-1-5--4------
----2-2-4--15-5
1---54-6--22---
-------------3-
---2---0----0--
----1---2---5--
-3--4----2-2---

Generation = 33, Population = 64.
----2----2-3---
---6-7----1---2
----21-------3-
----2-3-4-1---1
-----3-3---3---
--------3-7-22-
-----6-0---2593
----2-1-1---32-
---25----------
--36+44---3----
---03-+--3-1---
-----+-1--1----
------4--------
--------------0
---0---------6-
--2-5-2-1-5---0
---0-2-1---4---
----------2----

Generation = 44, Population = 103.
---------35-++-
--76--89----1-4
----517--43--47
-852-+----1----
----3-8------6-
2------84--4---
223--75-38+--+5
2----+4--6----4
3-3---3-----8--
----+-6----6--5
6---42---49--7+
--446+-2-14-31-
1-------7-6-9-7
--3---+----55--
----6---53--38-
23--5347-2-6--1
5-----8-4-8-9-6
3-5--9--4-24---

Generation = 55, Population = 138.
---1-363--7----
-----+-+-6-6-35
---2-2-1--7--68
--6--+9+5---2--
93-1-4+-+447---
463---49---4--4
-2--67-2-+-3-+-
47-89+88---955-
41-2+8--+8+--76
-----79-686----
-2-172+1-5-5-8-
---9-+14947----
-----4---793+--
5--++8-+2-6-731
---07--374429++
2---54--337-2-3
-0--82+--5-4+98
5-6+-+-+-446-3-

Generation = 66, Population = 53.
----------+3-+-
---+-+---7-----
----7-----+--79
-+---+++-------
------+---5---+
---4----8------
--------7---7--
--89-+---------
------+---+----
-7-+++---------
----7---7---+8-
---+-+---6-----
------8-7--4--+
---++----------
------+-9----++
--3--7---------
----------+---8
------+-+------

Generation = 77, Population = 133.
-1-295-6+9-5-++
64-+++-+-9686--
52---8-17--3---
-+--7++-88-+5--
-3-29-+--67--+-
-+7-+---9-+---9
-3+-+8-39--4---
7-+-++--3+-----
6-9--+---9+----
+-+--+-+-+-+3--
+2--+-+1-6-6+--
--++-+4-+--74--
4-538--3-++-++-
8--+--+-6+-++--
9-+0-4+-+-5--++
-+--9+----8-3--
8--0---2--+7-+-
7-7+-+-++67+7--

Generation = 88, Population = 97.
7-----+-----+++
99-+++++-----49
----98---+----+
9----+++------8
+-9-----+----+-
-+8+++6+---453-
+-+----------+-
-++---+-----99-
--+-++---+---++
+--+-+++------+
+-----------+++
-+-+--9------4-
6-----------++-
--5++++-----+--
+---+4---+--+++
6----+-+------6
9-6-+4+--9---+-
---+-+++---+---

Generation = 99, Population = 125.
-3+2-6+8-------
9+-+-+++--9-+4-
--6-+-+--+--+++
+-++-++----+889
-5--+--4--+-++-
--+-+---+-+8649
---2++-----7+++
---+-++-7-3--+8
-5+6+++2-+-9---
++++++++--+----
-4+4-9---------
--+-+++++---8--
--+--+-4++-5-+-
-+9+-+--7+--+-4
-2--+-+5+----+-
6+---+------5--
-28--7-6-9-8---
---+-+--+-+-+-7

*** Life<FredkinCell> 2x13 ***

Generation = 0, Population = 15.
-0-0-0--0-000
--000-00--000

Generation = 50, Population = 13.
+6--87+---+++
----+---777+-

Generation = 100, Population = 10.
-+--+-+++-+-+
---++--+-----

Generation = 150, Population = 16.
+++++---+-++-
++++-+--++-+-

*** Life<FredkinCell> 11x16 ***

Generation = 0, Population = 26.
---0------------
------0---0-----
----------------
---0----0--0----
0---0----------0
-------0---0----
--0--0-0--------
-00----0--------
-------00-------
--0-0---------00
---0----0-----0-

Generation = 19, Population = 92.
14-622-7-5-4----
42-4-453--3-3-14
7-5641-3-2--312-
-52--71-2-1-----
-3----34--13----
2--242--2----45-
4------2---6257-
-54--9--2---2---
3-66397-8-5+75-5
64-4--68675755-7
-172--3244-42-47

Generation = 38, Population = 87.
--+-7---96-----8
------9---6--+-+
+-9+--6---47-6--
5--26+---4--4-85
5-9----687--+-+-
+-+---6-4-+-88+4
+4-+786---9--++-
+++67--8--9--899
8--+9++8+-9+-8+-
--+7+-++++---83+
---6--58-8+---9+

Generation = 57, Population = 80.
-+--+--++-------
-----+++----+-9+
-++++-+-+-6-++-+
5-7-+-9----+8+-+
-++-5++-+---+---
--+--++-7--8++--
+--+--+9++-+-+--
++-7-++-++-99-++
-++--+-+-++-++--
-9----++----+-9-
---+---+-9---+++

Generation = 76, Population = 95.
-+-+---+-+-++-+-
--+++++--++++---
++-+++---++-+-+-
8+--+-+--89-+-+-
-++----++---++++
--++++++-++---+8
--9----++-++++-+
+-+-++----+----+
-+++--+---+-+--+
+++++6+-++-++--+
-+-+++8+-+-++-++

Generation = 95, Population = 98.
+--+-----++++--+
---++--+-++--++-
+-+++-+-+-+++-++
++--++---+-+++-+
--+++---++++-+-+
++++-++---+++---
-+---+++--+-+-+-
+++-++--++-+-+-+
--+-+++--++++++-
+++++++--++-----
+--++-++++++-+--

Generation = 114, Population = 82.
+----+--++----+-
+-++---++---++++
---+-+-+++++--++
-------+-+---+--
-+---+--+---+--+
+-+-+--+++--+-+-
--+--++-+-+-+-+-
---+--+---++-+++
++++--+-----++++
--+--+--+--++-++
-++++++++++++-+-

Generation = 133, Population = 99.
+++++--+-+-+--+-
+-++++-+-++--++-
+-+++--++++-+--+
-+---+--++--+---
+-+++-+++---++++
--+-+-+--++++-++
+--+-+--+-+-+---
++--+++++++-++-+
-+-++-+--++++++-
+-+++--+--++--+-
+-+-++---+++-++-

Generation = 152, Population = 75.
-++-----+-------
--+----+---++-++
+--++---+-----++
-+-+-++-++++-+--
+--+--+-+----+++
--+-+++---+--+++
+---++--++------
++++++-+-+------
--++--++-++-----
+-+-+--+--++++-+
++--+++---+-+--+

Generation = 171, Population = 91.
++++++-++-++-+++
+-+--++----+++--
-++-+-+-+-------
+++--+-++---+---
++-+--+-+--++--+
++-+---++++-++++
++---+++++-+--+-
+++-+++++---+-+-
----+--+---+-+--
+-++----+-+--+++
--+-++-++++--+-+

*** Life<FredkinCell> 9x19 ***

Generation = 0, Population = 9.
-------------------
0---0--0-----------
----------------0--
-------------0-----
-------0-----------
------0------------
-------------------
-------------------
--------0----0-----

Generation = 19, Population = 83.
2----326-31---6--3-
44-1549-442-1---2--
61-333--231114--2-1
--------32--3-351--
3--202-3----130--22
--2-145--0-21-1-3-3
110-23----2--+-2212
-0--2--6-------3200
---22-9-0-2---1-1--

Generation = 38, Population = 78.
--4648+++5-2-+++-8-
-65-97------2-7-436
+8--++8--8432975---
--6----9----8-4-2-1
--55-7684-65-8--9--
7-9-------9---5-966
---768--8+---+-5--5
3-----------1--8--1
-+----+8---3-2-+4+5

*** Life<FredkinCell> 14x5 ***

Generation = 0, Population = 13.
-0---
-0-0-
-----
-----
0----
0----
----0
0----
-----
0--0-
---0-
---0-
---0-
0----

Generation = 45, Population = 35.
4----
++--8
++3--
-+3++
--+--
5+--+
+-++4
-+--+
--8--
-+--+
+8++-
5--++
-9---
+-+9-

Generation = 90, Population = 29.
-+-+-
+-++-
-----
--8++
+--+-
+----
++---
--++-
-----
-+++-
++-++
-+---
++-++
-++--

Generation = 135, Population = 37.
-+-++
++--+
-++-+
--+-+
+-+-+
---+-
+-+++
+--+-
+++++
+--+-
--+-+
-+---
++--+
+++--

*** Life<FredkinCell> 9x7 ***

Generation = 0, Population = 26.
-0--0--
---0-0-
-00---0
00--0-0
0000--0
------0
-0-----
-00-000
-00---0

*** Life<FredkinCell> 14x18 ***

Generation = 0, Population = 26.
-0--0-0-----------
-------00---0-----
----00----00-----0
---0----------0-0-
------------0-----
------------------
---0--------------
----------------0-
------0-0---------
---------0--0-----
-0----------0-----
---0--------------
---0--------------
-------0----------

Generation = 38, Population = 134.
++++9+98----+5-4--
+79--+7---7+-++-74
+7----6---87-++7+-
4-6-6-895-+-588--5
+-++--+-99+7---9--
6---16--77--+9-3-5
8-+---+6-7+--+-7-5
----0-7-5-968-6-55
6---85--38+--5+2--
4--4589+9---+2+--5
-++++----39---8-66
-72----+7+8---4-+-
--67-+--+5-56--48-
-2--7658-+-8-88--5

Generation = 76, Population = 127.
+++++++-++++--+---
++---+--++--+-++-+
++-++----++--+++--
----+---+--+--+--+
-++-+++----++-+---
--++++++-+7-++-++-
+---++--+++++-++--
7+--7++++-+-------
-+-+--++-+-++--8-+
-+++++++-+++--+-++
--+--++++-+-+---++
+--+++8+------+--+
--++--+8+-++--++-+
------+--+-+-+---9

Generation = 114, Population = 132.
-++++++-++++---+--
+-+++++++++++-+-++
++-+++-+-+-----++-
+---++-++-+-+----+
+-+-+--+-+----++++
+++--++-+-++----++
------++-+-+++++-+
-+-+-+-++-+-++-+++
-+-+-++-+---+-+-++
---+-+--++--+---++
+-+--+-+--+-+--++-
++-------+-+++++--
-++++-++-+--++----
+--+-+-+--+-+++--+

Generation = 152, Population = 125.
+++++-----+-+++--+
-++-+-+---+-+++--+
--+++++++-+-+-++++
++--+--++--+---++-
+-++----+--+--++-+
+--++----+++--++-+
+---+++-++-+-++++-
+---+++-----+-++--
++++++++++-+-++-+-
--+-+----++++-----
-++-+--++-++---+++
-++-+-------+-+-++
-----+++++++---+-+
+---+-----+-----+-

*** Life<FredkinCell> 2x14 ***

Generation = 0, Population = 10.
00--------0--0
--0000----0--0

Generation = 1, Population = 19.
11-000---01001
0-1--10--01001

*** Life<FredkinCell> 13x15 ***

Generation = 0, Population = 4.
0--------------
---------------
------0--0-----
---------------
---------------
---------------
---------------
---------------
--0------------
---------------
---------------
---------------
---------------

Generation = 47, Population = 85.
5--5574-----7--
-0-0--00---0-0-
---2---2+-8-8-4
-0-00---0--0-0-
6---87--99--7--
-----0-0--0----
7----7-----66--
000-0000---000-
--5-34-68-7-665
--0-----00-0-00
-24304---2+-4--
-0---0---000--0
44-8-3+-7-+3-8-

*** Life<FredkinCell> 10x12 ***

Generation = 0, Population = 20.
-----------0
---0----0--0
----0-0--0-0
------------
-0--------0-
00-------0--
00----------
---00-------
0-----------
-------0-0--

Generation = 35, Population = 66.
57--3++8---9
-+--6+-6--8+
59-----9--7-
-75-8---588+
---57+-887-8
-++-8-++-+--
---72+3-8-8-
-5-+6+7--5-+
-+3+-451++-5
---8-+57+87-

*** Life<FredkinCell> 20x18 ***

Generation = 0, Population = 20.
------------------
----0-------------
-----------0-----0
--0-----------0---
-----0-0----------
------------------
-----------0------
------0---------0-
------------------
--------0---------
---------------0--
------0-0---------
-0----------------
--------------0---
-------0----------
------------------
--------------0---
-------0----------
----------------0-
------------------

Generation = 19, Population = 160.
0---01--00-01-400-
-0--010-010-105--0
--0--0-3010-0-----
------1-2----0---0
0---0-0-0-0-1---0-
-0---02232---0-0-0
--0-02-2012---0---
----21531-1220---0
-----00122-4-63---
-0----554---5-3--0
----0--50-0--531--
-0---2-3-0-1--5--0
0---------0-----2-
10----4--2-1-----1
21--01----1-03--2-
2-0--3---2-44331-1
20-111----0213-22-
--008-3-----231-5-
0-0-30-7-2-111-5--
---0-2474--02-3--0

Generation = 38, Population = 169.
-----------2-36--2
1-6----4--1-5-9-4-
-----2-+-5-148----
0---128-711-5-----
---1-----300---4-4
1-224-887--2--5---
-5---7-836-7-4--31
-09--4-8-4---0--9-
-------6-8-6-94--2
--3455+7-6-46-5-+-
-2-----+04-----64-
-1-233++-31363----
-2-6--29------2---
-3-3-589+6-246-2+-
-8-656-454-6-9---6
5-3596-6-6-9-7--53
--26-2-8-5-6-----6
48---78-9+46-+52-7
---3-3--36-91---19
4-63-7-964017+95-2

Generation = 57, Population = 192.
-5-4245-----7-+-+5
80+33-78------+-7-
4827463+--35-+9---
5-3244-+-22-+1+4-1
5--7-8-+-6-359-7--
-3-69-+-+96-8---+-
--2+--7---898---49
-2----+-+-+9--+1-3
58--6+7++-4+5+-8+-
859--7-----5+39-+5
-915-47+2---3+-+8-
+3+-5-++---6-9----
+55+---+8-----355-
5755--+++7-7--58+5
-+-++++--85-6-+---
--68--5+---+-+--++
6----8-+-+--+---7-
+-+-+++--+++++----
8---57+-7+4-59+---
-4-5-+8+++-6------

Generation = 76, Population = 138.
----58---6--------
------++---8+-+6++
-+2-78----7+---+-+
---9+-------+-+-+3
---+----19-+-+-+-+
7-+----+--77--+4-4
-8--7-9+---+-+++--
--+-+-+-+---+--4--
+--7--8+----9+---4
---6--+---+7+5-8--
7--9---+-+7----+-+
+---8-+-+-+8-----6
-68-7--+---+----7-
--+-+-++-8--+-9-++
-+4+-+-------++--+
+-+-+--------++8--
9--+-+--+--+-+7+-+
+---++-+----+++-+-
-+---+++---+----7+
---------+--+---++

Generation = 95, Population = 169.
-++-+---+----+----
+-++-+-+--+-+-----
+-7+----+++-++----
+---++---6+-----+8
9----+----6+8--+-+
++---++-++--+-----
-+8-+-+++++-++-+++
-5-+-+--+9-+-2+7+7
-+-+--+++-+---+++9
+8----+++--+-----9
---+9+-++++----+-+
+-+--++-+-+---+-+7
----+----+-+++++--
+-+-+-+-+-+--+--+-
+-6++--+-+--8++-+-
+-++----+++-++--++
+-------+++----+++
++--+--+++--+-++--
+-9+-+++++---+---+
---++--+++----+-++

Generation = 114, Population = 179.
7+------+-++-+--+-
--+-++++-+-++----+
++-+--+-+--++-++--
+-+----+-7---9+--+
--+----+--9--++---
+++--+--+--+++-6-+
++--+-+----++-++++
+------++--+-3+-+-
++++++--+-++-++++-
-9++++----+-+----+
++--+-++-++-7----+
-++--+++--++---8--
-+++--+++---+++---
---++++-++--++-++-
-+-++--+-+++-+++-+
+--+-++--++-+-+--+
++-++-++-+-+++--+-
-++++--+-++++-+---
+--+--+-++---+++++
-+++--++-----+-+--

Generation = 133, Population = 122.
----+-------+-----
---+---+-------+--
--+-------------+-
-----+---+-+-+-+-+
+-------+-+-+---+-
-+---+-----+-+----
--+-+-+-----+-+---
-9-+-+-----+------
--+-+---------+---
-+-+---+---+-++--+
+---+-++-----++++-
++-+-+++-+-+-++-+-
+++--+--++------++
+-++++--+++--+----
-+----+--+--+++-+-
--+-++--++--+-+++-
+-+---+--++----++-
---+--+-----+--+--
--++++---+-----+++
+++--+--+-+-+++-+-

Generation = 152, Population = 156.
-++---+-++--+--+--
+++-+--+--+---+-+-
+--++++--+++--++-+
+-+----++-----+++-
-+++-++------+++-+
+-+--+------+---+-
+---+---++++-+++++
+++-----+-+--6----
++--+---+--+-+--++
+-----+--++-+--+--
+-+--++-+---+-++--
--+-+-+-+-+-+++---
-+---+-------+-+-+
+-----+-+----++---
--++--+----++-+--+
+---+++-++----+-+-
++++-++-+---+-++++
+-+---++--+--+--++
+--+++++++---+++--
+-+--++---+-----+-

Generation = 171, Population = 184.
++-----+-+--+--++-
-+---+----++-7-+-+
-++-++-++-++---+--
----++----+--+-++-
-+--+-++++-+-++--+
--+++-+++-+---+-++
+++----++++++---+-
-+-+++---+--++-+-+
+-++-++---+----+++
--+-+-++----++-+-+
-+-+-+--+-++++--++
--++--++++++-++--+
-++------+--++-+-+
-++++++++--+-++---
---++-++---++-+-+-
+--+---++++++++++-
+++++++-+--+-++-++
++-+---+-+--+++++-
----+---+++++-+---
--++++++-+--++---+

*** Life<FredkinCell> 7x16 ***

Generation = 0, Population = 24.
-----0-0-0--0---
--0--00----0-0--
----0---00------
----------0--0--
----------00----
----0--------0-0
-00--0--------00

Generation = 20, Population = 63.
-5-68-3--59-3--0
-6-54824--663223
5-74-44-5-57-7-3
414--2-12-6-----
--7-73-41-6-3628
-2-5-783-2-6----
8884--4--3-94-+-

Generation = 40, Population = 52.
--7---7---++--67
4+---+++6+---6--
--+59-----+--+85
+--29--2-4--+4--
39--+8-----+9--+
4--8++----++-94-
--+-+989+7-+---+

Generation = 60, Population = 42.
++----++-------+
+--++++--+--++-+
+-+--+---++++---
----------+--6--
8-+-++--8---+---
8-++-----+-+++--
+-+---+--+--+-+-

Generation = 80, Population = 55.
-+----++++-----+
----+-+++++-++-+
-++++-+-+++++-+-
+6+--+-6+-+-----
+++----++++-----
------+++-----+-
+++-+-++++++--+-

Generation = 100, Population = 56.
+-+++++++++-++-+
-+-+----+++-++--
++---++------+++
+--7+--7-+--++--
--++--+---+++--+
----+-++---++++-
+-++--+-----++++

Generation = 120, Population = 24.
-----+-+-+--+---
--+--++----+-+--
----+---++------
----------+--+--
----------++----
----+--------+-+
-++--+--------++

Generation = 140, Population = 63.
-+-++-+--++-+--+
-+-+++++--++++++
+-++-++-+-++-+-+
+++--+-++-+-----
--+-++-++-+-++++
-+-+-+++-+-+----
++++--+--+-++-+-

Generation = 160, Population = 52.
--+---+---++--++
++---+++++---+--
--+++-----+--+++
+--++--+-+--++--
++--++-----++--+
+--+++----++-++-
--+-++++++-+---+

Generation = 180, Population = 42.
++----++-------+
+--++++--+--++-+
+-+--+---++++---
----------+--+--
+-+-++--+---+---
+-++-----+-+++--
+-+---+--+--+-+-

*** Life<FredkinCell> 5x14 ***

Generation = 0, Population = 13.
-0--00--00----
-------0------
---0------0---
0-------------
00-------0-0--

Generation = 37, Population = 36.
+-+-+-+9---8--
6-66-3--294+--
-++-9-3-+--++-
+2+-+-----9-74
9-7++6++-8----

*** Life<FredkinCell> 10x7 ***

Generation = 0, Population = 19.
0-0--0-
00-----
0----00
-0-0---
0-0----
-----0-
----0-0
----0--
00-----
-0-----

*** Life<FredkinCell> 6x17 ***

Generation = 0, Population = 2.
---------0-------
0----------------
-----------------
-----------------
-----------------
-----------------

Generation = 22, Population = 26.
-0-0---------0---
--0-0---0-0-0-0--
-0---0-----0---0-
--0-0-0---0-0-0-0
---0---0-----0---
----0-------0---0

Generation = 44, Population = 5.
-----0-----------
--------------0-0
---------0-------
0----------------
-----------------
-----------------

Generation = 66, Population = 16.
-0-0-------------
0---0-0-0-0------
-0-------0-------
--0---0-0--------
-------0---0-----
0-0--------------

Generation = 88, Population = 8.
-----0-------0---
0-0-0------------
---------0-------
-----------------
---------0-------
0----------------

Generation = 110, Population = 29.
---0-----0-0-0-0-
--0-0---0---0---0
-0-0-0-0-0-0-0---
--0-0-----------0
-0-0-----0-0-----
0-----0-0---0-0--

Generation = 132, Population = 10.
-0---------------
----------0-0----
-------------0---
--0-0------------
-----0-----------
0-------------0-0

Generation = 154, Population = 18.
-----0---0-0-----
0-0-0-------0-0--
---0---------0---
----0-0---0-0----
-0-------------0-
------0---0------

*** Life<FredkinCell> 19x12 ***

Generation = 0, Population = 27.
----0-0-----
-----------0
0-0---------
----------0-
-0------0--0
-----0----00
------0-0--0
00---0------
--------00--
------------
0-----------
------------
--0---------
------------
--------0---
------------
---------0--
---0--------
--0----0----

Generation = 39, Population = 116.
---76-------
-+-7+57-5-7-
7-+----5++--
95--+-----+-
66-+34658--+
++--8-++-++-
++-4+--3--8+
-9+9+8-+-+--
-++272-8-98-
--1+---4-8-6
-8----8-----
---+63----+5
-8-+23+-+3-3
+46-5-4--6--
+4-2-7--+-+8
+9+-7--5-8-4
236-+-+8-762
-8----4-6+--
----99+-+7++

Generation = 78, Population = 125.
++++-++---++
+++-++-+---+
+++--+-+---+
----++++-++-
++--68--+-++
++-+---+++--
+++-++--++++
+-+-+-+++-+-
-+---+++-+--
-+--++---++-
++-8++++++--
+-++-+---7+-
--++4+++-8-+
---9+---++-+
-+---+---+++
++-+-+-+--++
+9+-+--+-+--
--+-7--+++--
+7+-+++-++--

Generation = 117, Population = 111.
--+--+++----
--+-------+-
-++-+---+---
---+--+-++-+
+-++-+++++-+
+++--+-+-+--
-++-----+--+
----++--+---
+++--+++-++-
++---+----++
+-+-++---++-
+--+---+++-+
--+-+++++++-
-+-++-+++--+
+---++++++--
+--+++---++-
-+++++++--+-
-++--+-++---
+++--+++-+-+

*** Life<FredkinCell> 3x3 ***

Generation = 0, Population = 8.
00-
000
000

Generation = 43, Population = 0.
---
---
---

Generation = 86, Population = 0.
---
---
---

*** Life<FredkinCell> 5x8 ***

Generation = 0, Population = 1.
---0----
--------
--------
--------
--------

Generation = 39, Population = 12.
0---0-0-
---0---0
0-0-----
-----0--
0-0-0-0-

Generation = 78, Population = 4.
-0---0--
--------
---0----
--------
-0------

*** Life<FredkinCell> 6x20 ***

Generation = 0, Population = 13.
--0----0------------
--0-----------0-----
---0--------------0-
--------------------
--------0-----00----
--0-----0-00--------

Generation = 28, Population = 61.
-4--6-3--47+-5--23--
7--551-3554886---0--
5----3---4963-671328
--9-21----8+--+-615-
--56-+-7---14-4493--
-29----9-2-+95-6---5

Generation = 56, Population = 54.
--+--+-8-9+--7---5+-
+-+-+------++----1+-
+-+7--9++-++-9-+-8-+
-+--6-+--++--++---++
--9-++--++-6---++8-+
-+-+--+----+++-++---

Generation = 84, Population = 59.
---+-++++++++++++---
--++-4++----++++----
-+---+---+-+--+--+++
+--++--+++++7++--+--
-++--++---++-+-----+
-+-+-+-++-+-++----+-

Generation = 112, Population = 57.
-+++---+-+-+----+-++
--+---+-+++----++-+-
-++-+++++---+--++-+-
--+--+---+----++----
+--+-+-+++++-++++-+-
+-+--++--++++-+-+--+

Generation = 140, Population = 55.
++-+-+-+++--+--+----
++-++-----+---+---+-
-----++++--+-+++----
-+-+-++-+-+-+-----+-
++--+--++++---++++-+
+--+-++++--++-+-+-+-

*** Life<FredkinCell> 18x4 ***

Generation = 0, Population = 19.
----
0-00
----
----
00--
-0--
00--
-0--
----
-0-0
----
00--
---0
0---
----
00-0
-0--
----

Generation = 13, Population = 33.
6--2
--6-
----
--25
3---
-032
--33
--0-
20-0
---8
-522
-3-1
-432
-4--
25-4
504-
--03
----

Generation = 26, Population = 36.
-96-
---+
---4
-35-
-8--
---7
6-5-
73-3
--54
-91+
+-4-
--9-
58-6
-53-
5+-4
--6-
6--6
9863

Generation = 39, Population = 38.
----
8-+-
9---
+7-+
-9+-
+9--
+-+5
+--9
--+8
5+5+
--7-
----
8+5-
8+7-
++-8
+8-7
-7--
+-97

Generation = 52, Population = 45.
++-8
++-+
++++
+--+
-+++
-+++
+++5
-9++
8+-+
-+-+
-++4
+--8
--5+
+-9+
+---
++--
----
++--

Generation = 65, Population = 32.
--++
--++
+---
+--+
---+
-++-
-++9
-+++
+---
+--+
+---
++--
--+-
++-+
--8+
-++-
----
+--+

Generation = 78, Population = 37.
----
++++
++-+
-+++
+-++
+-+-
+-+-
----
---+
+-9+
-+--
--+-
++++
-+--
-+9+
-++-
+--+
--++

Generation = 91, Population = 37.
---+
+-+-
-+--
++--
-+-+
+-++
+++-
+-++
++-+
---+
--++
-+-+
-+--
+++-
--++
+-+-
++--
+--+

Generation = 104, Population = 38.
-+++
-++-
----
---+
-+++
+-+-
---+
+---
+-++
+++-
++-+
++++
+++-
-+++
----
+-++
+---
-++-

Generation = 117, Population = 34.
----
-+++
+++-
-+--
-+++
+-+-
-+-+
+--+
----
--+-
-++-
--+-
-+-+
+++-
--+-
--++
++-+
-+++

Generation = 130, Population = 36.
----
++--
+-++
-+++
----
+--+
+-+-
--++
+--+
++++
++--
+---
-+-+
+-++
+---
+++-
+++-
-+--

Generation = 143, Population = 36.
-+-+
---+
--++
-++-
-+-+
+++-
--+-
+--+
---+
+-+-
+++-
++++
+--+
----
+++-
+--+
+--+
-++-

Generation = 156, Population = 35.
----
-+-+
--+-
-+++
++++
----
--++
-+-+
+++-
++-+
-+-+
-+-+
++-+
++--
---+
+++-
+-+-
----

Generation = 169, Population = 35.
--+-
++--
--+-
-+--
-++-
+-++
-++-
++++
++++
----
-+--
+-++
-++-
++--
++-+
-+--
-+-+
--+-

*** Life<FredkinCell> 12x5 ***

Generation = 0, Population = 15.
--0--
---00
-0--0
---0-
-----
0---0
-0---
--0--
00---
--0--
-0---
0----

Generation = 37, Population = 28.
-+---
---+-
-6949
+6--+
-+-5-
--7+4
-++7-
+-+--
--+--
---+9
++5-8
9---9

Generation = 74, Population = 30.
+--8+
-7-++
--+9+
++-+-
+-+9+
+-+--
---+-
-6+--
--+9-
+--++
-+-++
+----

Generation = 111, Population = 30.
+++-+
----+
-+++-
+--+-
--+--
-+--+
+-+++
+++--
+-++-
--++-
-++--
++--+

Generation = 148, Population = 24.
-++--
---+-
++--+
+-+++
--+-+
+---+
-----
---+-
+---+
--+-+
--+-+
+--++

*** Life<FredkinCell> 17x9 ***

Generation = 0, Population = 13.
---------
--0-0----
---------
--------0
0----0---
---------
---------
--------0
------0--
------0-0
---------
----0----
------0--
----0----
---------
---------
0--------

*** Life<FredkinCell> 15x14 ***

Generation = 0, Population = 5.
--------------
--------------
--------------
--------------
--------------
--------------
--------------
---0----------
--------0---0-
--------------
-------------0
--------------
--------------
-------0------
--------------

Generation = 11, Population = 70.
-----0---0-012
------0----0--
---------001-2
------0----00-
---0-0-0-0-00-
0-0-0-0------0
-----0-0-0----
0-0--100--0---
---00---1--1-1
--010-0--2---0
-00-------0-3-
0--00-0-00-10-
----0---110--6
-----000--01--
-----0---0--4-

Generation = 22, Population = 52.
--------------
---------1-2--
0-0-0-1-------
-------0-1-3-1
-0----0-0-----
-----0-1-0-0--
1-22----0-0---
---0-----1----
--0-02----0-1-
---4-------1--
2-3----72-0---
-2-3---1-----1
-----21-1-----
-3-------1---6
12221-0-------

Generation = 33, Population = 21.
--------------
--------------
--------------
--------------
--------------
--------------
-0---3--------
0-0-0---------
-1-----2------
------0----3-4
----------2---
-----------3-2
-----5---3----
----0-0-0-0---
-----3---2----

Generation = 44, Population = 61.
--1-------20-3
-----3---2----
------22-6-2-2
-2---2---3---2
0-----0-------
-5-----------2
---3-4-3-5-5-3
-----------4-0
--4-3------2-2
-4---------4--
-4-2-958-9-5-5
-6---6---8---6
4-----53-3-5-9
-----4-4------
--43-3-0-237-5

*** Life<FredkinCell> 18x6 ***

Generation = 0, Population = 10.
---0--
------
0--0--
---0--
----0-
-----0
------
------
------
------
---0-0
------
------
----00
------
------
------
------

Generation = 10, Population = 43.
-4----
-0-2-3
-74--8
-3-20-
0--43-
-20--2
-11--3
-0--02
10-2-1
---1--
0-011-
2-1---
1-1---
--33--
----1-
10-2--
------
----31

Generation = 20, Population = 48.
36---4
00----
7+7+3-
---51-
0--5--
-3-+35
1-1-2-
0---26
3-1--4
-211--
2---73
----36
--23-2
96----
-1--2-
-6-2--
-----2
--46-3

Generation = 30, Population = 45.
59-+55
--6-4-
---+--
5-392-
--+--8
-41---
------
-354--
--58-7
3-24--
-6--9-
----3+
-6-+9-
+-----
--2732
-914-6
4-4---
-5--+-

Generation = 40, Population = 45.
-+8---
---+--
-+----
-+----
-5-9-9
6---7+
-6-859
547---
-2----
-8--85
---7+-
-+--8-
+--++-
+-++98
---+--
7+-7-+
4-----
169+-7

Generation = 50, Population = 62.
++++--
877+7-
+---+-
7-6--+
-8--++
8+3++-
4+--7-
-6+-++
----9+
7-4--+
7-7+-6
6+-++-
---+--
++----
3---98
+-499+
9+8-9-
57+++-

Generation = 60, Population = 51.
++-++-
++-++-
+--++-
---+-+
--++++
--6+-+
--8--+
-----+
--+--+
-+--9-
-+----
-+-+-+
-+++++
+++++-
-+7---
---++-
--9-+9
88--+-

Generation = 70, Population = 63.
-++--+
+-++-+
--+--+
++-+++
5-++++
-+7-++
---+-+
++--+-
+---++
+-68++
+--+-8
+--++-
--+--+
++--++
8+++--
-+6+++
+--+++
+----8

*** Life<FredkinCell> 10x20 ***

Generation = 0, Population = 17.
-0------------------
-----------0--0-----
--------------------
---------------0----
--------------0-----
--------------------
---------0-------0--
0-----0------0------
----------------00--
--0---------0--0-00-

Generation = 35, Population = 109.
4--227--3-28-8--53+7
-67-779---9-+9--35--
32-2--563---5----9--
5-5--8--676---+-5-++
9-71----4-738835957-
-7-81-67-87836---5+7
391--37--339--693477
56+6-6--9--9--+9+6--
-6-743--+-785---+--7
-4-825--+-2-7-+-----

Generation = 70, Population = 101.
-++-----+-+++-----++
+--+++-+6--++-+---++
9+-9-++--+++---+-++-
++++-++-+---++-++--+
+-------+++----++---
++5-9---+----+--5+++
+-+-++-+++---+9-----
-+---+++-+++++++-+8-
++--+-+--+--8-++-++-
--+-++-+++---+++++--

Generation = 105, Population = 107.
+--+++++-++---+-+-++
++++++++-++-+-+-+-+-
++---+++--++--++++-+
-+++++-+-------++-+-
+----++++---++++++--
---+-----+-+-+++++++
-++--++++++-++--++++
---+---+--+++-++-++-
+-+-++-+-+---+--+++-
----------+-+-++-+-+

Generation = 140, Population = 105.
-++++--+-+++-+-++-+-
-++---++++++--+----+
-+-+--++++-+-++----+
--++-+-+-+-+-+++++++
++----+---++--+---+-
+++--+--++--+----+-+
-----+---++-++-+-+++
+--+++-+++-+-+-+++++
-+---+++-++++-+-+++-
---++----+++++----++

*** Life<FredkinCell> 5x2 ***

Generation = 0, Population = 10.
00
00
00
00
00

Generation = 32, Population = 6.
++
--
++
--
++

Generation = 64, Population = 6.
++
--
++
--
++

Generation = 96, Population = 6.
++
--
++
--
++

Generation = 128, Population = 6.
++
--
++
--
++

Generation = 160, Population = 6.
++
--
++
--
++

*** Life<FredkinCell> 8x18 ***

Generation = 0, Population = 9.
0---0--------0----
------------------
--------------0---
-----0------------
------------------
-----0--0---------
--0---------------
--------------0---

Generation = 13, Population = 80.
--112----32---22-1
--011-33723022-03-
1--013-01-1-45-5-0
2--12--22-01-1511-
-01-3-1-10---4----
24--325-3-022-3-4-
30-04-1-2-0--52232
2--0--20-----030--

Generation = 26, Population = 73.
4---44-3-844---4--
--14----9---85-57-
5--1--87621------3
651--2-2+8---5-4--
32---3734-522---5-
-7--+-+-78335--7-5
6-61621--12-482---
65--55---530-06--2

Generation = 39, Population = 66.
--3-+---8+676----3
44---5-++6-3-7879-
--9----+8-6-8---6-
9-74----++3+-8-9-7
--7-8-+---753---72
+877-9+5+--5---+--
+-+---3--43-------
-6----+445---0-5-3

Generation = 52, Population = 68.
-+--++--+---++++-+
--+6-9+++--9-+---5
---469--+8+-+-6+9-
-8+-9+7--+5+7+-++-
8----5--+2964-----
+-8-+++-+++--8+-+-
-4-------6--+---+-
+---+8-6------+6--

Generation = 65, Population = 68.
8++8---++++-++++-+
-8+-+--+-+-+++-++-
---------+-6--+--9
----+-++-+9---+-+-
--+--5--+----+-8+-
++-++---+----+++++
-6-8-+-9-89-+-8-+6
+9-7+---+8-4-2----

Generation = 78, Population = 79.
--++-----+--++--++
--++++--+++--+--++
--+-++++---++-+--+
-++++----++---++--
+++-+7-9+3+++--9+-
+-++-+-++-+++-++++
--+-+--+--+--++---
++++++++-+--+-+-+9

Generation = 91, Population = 74.
+-++--++++-+-+++-+
--++++-++-+++++-+-
+-+9++-+-+-+---+++
+-++-++++--------+
++-9----+4+-+--+++
-+-+-------+++-+--
-+----++---9-++---
-+-+++++-+---7+---

Generation = 104, Population = 58.
-+-+---++++----+-+
-+-++----+-------+
-+++--++++-+++-+--
--+---+---++---+--
+-++-+---4+--++--+
-+-+------++--++--
-+-+--++-+---+---+
-++--+-----++8---+

Generation = 117, Population = 69.
--++-+----+----+++
+--+--++-+++--++--
++++-++-+++-+-----
+-+----+--+-+-+--+
+---++++--------++
+-++-+--+----+--++
+-++--++--+-+-++--
+-++--+++++++++---

Generation = 130, Population = 50.
-------+-+--+-++--
---+-+--+--------+
+---+---++++++++--
---++++--++----+--
+-------+-+-++----
+-++-++-++----++--
--+-----+---+-----
--+++-------+-+-++

Generation = 143, Population = 88.
+++++--------+++-+
-++-+-++++++++++--
---+++++++---++++-
+-++-----+++-+-+-+
-+++++-+-+-++-+-++
+++++++-++-----+--
--+-++++-+-++++++-
---+-+++++++--++++

Generation = 156, Population = 74.
+++-+------+--++++
---++++-+-+--++-+-
-+-+----+-+++-+-++
---++--+-++++--+--
+-+-+++-+-+---++-+
++++++----++-+----
+---++++-++++-++--
-+++--+------+++++

Generation = 169, Population = 56.
-+---+++-+--+++++-
--+--+-----++-----
--+---+-+---------
+---+--+-+++-+--++
++-+++---+----++++
+-+-+-+--+---++-+-
--++---+--+-++---+
-+-----++--+---+--

*** Life<FredkinCell> 12x4 ***

Generation = 0, Population = 19.
----
00--
---0
0--0
0--0
0---
---0
--0-
-000
-0--
-000
--00

Generation = 10, Population = 23.
-3--
3--0
3608
-31-
3-6-
14-0
31-2
---1
1--2
-32-
----
4---

Generation = 20, Population = 24.
26-1
-34-
--1+
-934
5---
--9-
92-4
--53
----
-550
9-5-
-2-5

Generation = 30, Population = 22.
---4
-4-6
8+--
-+--
8--6
--+8
+-+9
----
8-+8
-8--
-58-
57-8

Generation = 40, Population = 21.
-8-+
-6-+
-+8+
++--
+--7
+---
+8+-
----
----
7+--
+++-
--6-

Generation = 50, Population = 26.
--6+
-6-+
-+-+
+--9
+--+
-+++
-+++
3---
-++-
--+5
-+++
8--+

Generation = 60, Population = 27.
++-+
+99+
-+--
-++-
----
-++-
++--
4++9
++-+
+---
++++
-+--
