28

9 8
7
3 5
6 0
1 4
0 5
6 1
8 2
1 2
8 2

8 12
8
6 5
3 2
1 9
0 0
4 8
0 10
3 7
2 4
7 4

12 14
19
1 13
6 0
7 11
3 6
7 0
11 4
9 12
10 8
9 12
8 11
5 13
1 6
1 8
2 1
11 1
8 0
0 11
7 6
11 1
8 4

9 12
8
4 10
1 3
6 6
6 1
4 0
6 7
4 6
3 4
8 4

7 9
15
5 6
5 4
0 3
6 0
1 3
6 3
5 4
4 0
1 7
3 6
3 1
5 6
6 5
1 6
2 6
7 1

13 8
18
12 4
12 7
6 3
3 1
11 3
9 5
4 3
6 5
10 1
8 2
9 5
3 6
10 4
10 7
7 3
3 7
3 7
2 3
3 1

15 9
15
0 3
0 1
13 1
5 7
1 2
2 6
5 4
6 1
9 6
11 0
4 3
1 7
9 8
12 0
1 4
8 2

10 8
15
0 3
1 1
6 3
4 0
5 2
8 1
6 5
5 3
1 7
5 7
8 1
1 2
8 5
6 0
7 4
8 3

15 14
17
11 8
13 11
6 11
8 5
2 11
12 9
3 5
6 7
11 11
10 7
0 0
0 4
3 2
1 11
7 5
0 3
8 4
2 3

8 10
11
0 4
0 1
6 4
4 3
2 6
0 4
3 6
3 0
1 5
6 7
5 2
1 3

9 12
17
1 4
5 1
3 8
3 0
4 3
5 3
1 0
5 4
0 0
7 9
4 5
7 8
0 7
2 6
0 11
0 5
7 10
7 1

11 14
27
4 4
7 12
1 10
0 8
2 12
8 10
4 1
9 8
0 12
5 10
4 9
4 7
0 11
8 12
4 8
1 5
7 7
9 10
0 1
10 10
5 6
1 5
5 1
3 7
9 13
4 12
2 11
6 1

12 10
16
4 6
0 6
7 6
3 2
8 8
11 3
7 3
10 1
2 2
6 0
9 9
0 7
0 7
3 2
0 9
1 7
11 3

12 15
19
5 2
1 12
0 14
10 5
8 5
8 4
5 9
5 12
0 0
5 4
0 5
11 2
4 13
11 4
1 13
7 11
7 0
0 5
3 10
3 2

9 9
8
5 6
8 1
8 0
6 4
0 0
1 1
8 2
5 2
2 3

10 15
19
4 8
7 4
8 6
9 0
0 12
4 11
9 10
2 0
3 1
8 9
1 12
4 6
9 14
3 4
0 6
9 3
2 14
2 9
9 13
1 1

7 13
21
5 4
3 9
5 5
1 12
1 8
4 7
1 5
3 4
1 12
1 2
3 11
5 1
3 11
0 5
6 5
3 9
4 5
2 7
6 3
0 6
2 10
10 4

8 7
9
7 0
5 1
2 2
2 6
7 5
5 1
5 0
3 4
0 5
8 2

8 11
10
0 6
1 3
1 7
0 2
7 10
0 10
3 0
7 5
2 0
5 0
2 3

10 10
17
2 2
3 0
7 7
2 4
1 2
3 0
9 2
9 3
5 9
9 6
4 3
6 6
0 8
9 4
4 8
0 8
4 8
12 3

12 9
11
5 1
7 8
6 5
8 5
2 1
5 7
1 4
5 7
1 6
0 4
6 8
12 4

7 11
7
4 10
1 5
5 5
5 8
6 2
3 6
2 9
8 3

9 9
7
0 4
5 7
8 8
1 5
5 4
2 7
3 5
1 4

12 13
25
9 11
0 8
1 0
8 8
2 8
2 4
3 9
6 9
7 11
2 4
6 8
6 2
5 6
5 3
1 10
1 7
4 6
5 2
11 0
7 7
9 12
7 10
0 1
9 0
10 2
4 4

7 8
10
0 4
4 4
6 0
3 1
0 7
2 3
4 1
2 7
3 4
5 7
4 3

10 9
22
2 2
0 5
5 7
3 8
1 8
2 7
9 4
0 3
0 0
5 1
6 3
6 0
4 8
0 6
2 6
4 7
6 3
2 6
6 8
5 6
5 5
8 8
4 3

9 10
21
4 4
7 1
4 6
3 9
4 9
6 2
3 4
0 1
2 2
4 8
8 0
8 4
3 9
5 6
0 8
5 5
3 2
6 2
2 3
1 3
2 7
5 2

15 14
20
10 5
11 3
9 5
4 13
6 5
13 10
8 6
7 9
9 10
1 9
13 3
6 9
5 9
4 0
6 9
11 2
7 10
11 9
4 2
2 3
4 3
