20

10 9
9
3 0
6 3
4 4
0 8
9 2
6 1
7 3
9 3
8 3
8 4

12 13
30
5 6
7 10
9 12
0 8
11 11
6 1
6 1
7 0
3 8
3 2
2 1
11 8
2 2
5 2
1 5
8 7
3 7
10 12
6 3
1 6
0 5
2 0
8 10
5 6
10 3
8 3
0 9
8 0
8 3
3 10
1 4

8 9
15
3 6
4 3
7 3
6 5
1 5
1 5
2 7
5 1
0 7
0 2
2 4
6 3
7 0
2 4
1 2
2 4

10 9
7
0 7
5 5
8 0
9 2
4 8
2 6
6 2
4 2

14 13
9
5 9
12 3
6 11
8 0
8 2
4 2
9 6
13 2
11 4
1 1

10 12
16
5 0
3 11
0 2
1 5
1 2
4 1
0 3
9 4
1 9
7 9
9 10
8 1
5 10
0 9
0 5
3 8
7 4

12 14
16
1 12
4 1
2 2
2 10
10 7
7 6
9 4
1 1
10 13
4 5
1 8
10 2
11 10
11 10
2 6
11 5
4 3

12 13
32
11 2
1 6
10 7
4 2
9 5
1 2
3 8
2 2
8 9
8 6
2 11
8 5
0 1
8 12
0 3
9 11
4 11
5 4
4 9
8 7
5 8
11 9
9 8
7 6
9 7
0 1
1 11
5 6
10 10
0 2
5 10
4 12
4 1

14 9
12
1 3
8 5
7 2
2 1
11 7
9 3
4 5
9 8
1 3
7 0
4 8
13 3
9 3

7 7
11
2 1
3 0
4 0
0 1
3 3
3 1
0 5
2 4
5 2
5 1
6 6
6 1

12 10
27
2 4
4 6
8 0
11 0
7 8
3 7
6 8
10 2
8 6
0 9
6 3
7 3
8 3
6 0
4 7
5 2
0 9
11 9
10 5
7 6
10 0
9 4
11 1
7 7
4 3
11 5
2 3
12 2

13 12
35
6 2
12 5
7 3
8 2
10 1
5 11
0 2
10 3
0 9
8 5
4 9
2 7
12 6
0 4
12 2
6 4
1 11
3 3
8 6
10 6
7 3
0 6
3 0
12 1
10 5
10 7
6 8
5 5
1 7
0 3
4 3
9 9
9 7
1 4
2 4
9 1

14 15
47
1 14
12 8
1 5
11 0
4 11
1 12
8 1
13 1
13 0
8 3
0 3
3 6
6 12
2 3
4 6
13 10
6 8
0 11
10 0
8 10
11 12
10 10
0 11
4 11
9 12
1 1
10 1
5 1
1 7
9 14
8 2
11 5
5 5
11 4
8 1
3 10
4 6
12 10
4 0
4 2
3 13
8 12
12 12
6 1
5 0
9 4
9 10
10 3

13 12
33
8 10
9 2
2 1
0 4
1 4
3 11
2 8
1 11
10 2
8 9
0 1
12 11
6 10
1 6
9 4
8 4
5 4
9 10
10 11
7 9
4 0
7 5
10 1
9 9
2 2
9 0
1 6
7 4
2 6
9 7
9 2
12 8
6 6
7 4

11 10
15
2 6
1 5
9 5
0 3
7 8
3 6
0 0
7 7
6 6
7 1
2 5
2 8
3 2
4 8
2 9
3 2

10 11
21
7 6
6 1
3 5
8 8
7 3
4 3
5 1
3 6
9 0
3 2
1 7
7 3
7 6
4 5
4 7
4 0
4 0
8 4
6 9
9 4
5 3
4 2

15 13
7
8 1
2 1
14 0
4 6
6 10
3 3
11 7
11 4

15 8
19
5 7
8 6
13 4
8 3
8 2
7 6
12 7
8 0
1 3
8 4
8 6
1 1
12 1
0 1
11 1
3 7
6 2
12 5
3 6
1 1

9 15
20
6 12
7 7
0 8
2 5
3 4
4 3
6 5
0 13
5 7
7 0
7 8
8 11
1 4
0 12
5 14
8 13
7 6
7 3
5 7
8 1
10 2

15 9
12
10 5
13 6
2 7
4 3
0 3
9 0
7 8
0 3
7 5
7 8
9 2
12 0
10 1
