*** Life<Cell> 1x1 ***

Generation = 0, Population = 1.
0

*** Life<Cell> 17x12 ***

Generation = 0, Population = 8.
----------0-
------------
------------
------------
------0-----
-----0------
------0-----
--------0---
------------
------------
------------
--------0---
-------0----
------------
------------
--0---------
------------

Generation = 154, Population = 12.
...**.....-.
...**.......
............
............
............
............
.........**.
........*..*
........*..*
.........**.
............
............
............
............
-...........
............
......-.....

Generation = 308, Population = 12.
...**.....-.
...**.......
............
............
............
............
.........**.
........*..*
........*..*
.........**.
............
............
............
............
-...........
............
......-.....

*** Life<Cell> 8x14 ***

Generation = 0, Population = 7.
--------------
--------------
-----0--0-----
-------------0
--------------
----------0---
--------0-----
0--------0----

Generation = 154, Population = 4.
..............
..............
..............
..........**..
..........**..
..............
-.............
..............

*** Life<Cell> 7x13 ***

Generation = 0, Population = 13.
-------------
0------0--000
-----0----0--
------------0
0-----0----0-
-----0-------
---0---------

Generation = 128, Population = 10.
...........*-
..........*.*
..........*.*
.**........*.
.**..........
.............
............-

Generation = 256, Population = 10.
...........*-
..........*.*
..........*.*
.**........*.
.**..........
.............
............-

*** Life<Cell> 18x10 ***

Generation = 0, Population = 13.
-----0----
----------
-----0----
------0---
----------
-------00-
-----0----
----------
---------0
----------
----0-----
---0------
0-0----0--
----------
----------
----------
--------0-
----------

Generation = 108, Population = 0.
..........
..........
..........
..........
..........
..........
..........
..........
..........
........-.
..........
..........
..........
..........
..........
..-.......
..........
..........

Generation = 216, Population = 0.
..........
..........
..........
..........
..........
..........
..........
..........
..........
........-.
..........
..........
..........
..........
..........
..-.......
..........
..........

*** Life<Cell> 20x14 ***

Generation = 0, Population = 20.
--------------
--------------
--------------
0-------------
--------------
------0-------
-----0-----0--
0-------------
-----000------
0---------0---
-----------0--
-------------0
-------0------
-------0------
--------------
--------0-----
--0-----------
--------------
-----0---0----
-------0--0---

*** Life<Cell> 5x8 ***

Generation = 0, Population = 10.
---000--
--------
-----00-
-00----0
----00--

Generation = 74, Population = 0.
........
........
-.......
........
........

Generation = 148, Population = 0.
........
........
-.......
........
........

Generation = 222, Population = 0.
........
........
-.......
........
........

Generation = 296, Population = 0.
........
........
-.......
........
........

Generation = 370, Population = 0.
........
........
-.......
........
........

*** Life<Cell> 20x20 ***

Generation = 0, Population = 19.
--------------------
---0-------------0--
0----------------0--
-------------------0
---0----------------
--------------0-----
-------------0------
----------0-------0-
--------------------
--------------------
--------------------
--------------------
---0-----0----------
------0-------------
----------------0---
--0-----------------
---------------0----
--------0-----------
----0----0----------
--------------------

Generation = 94, Population = 58.
-.....-...........-.
....................
....................
...............*....
....**........*.*...
.................*..
..*.**......*....*..
.**.*......*.....**.
.***........*..*....
.............***..*.
...............****.
....................
....................
..*.................
.*.*................
**.**...............
*...*........*......
*.*..**.....*.*.....
*..**.*....*..*.....
***...*.....**.....-

Generation = 188, Population = 21.
......-...........-.
....................
....................
...............**...
...............**...
....................
....................
....................
....................
..................**
..................**
...*................
..*.*...............
..*.*...............
...*................
....................
.............*......
............*.*.....
...........*..*.....
............**.....-

*** Life<Cell> 6x1 ***

Generation = 0, Population = 5.
0
0
0
0
-
0

Generation = 42, Population = 0.
.
-
.
.
.
.

Generation = 84, Population = 0.
.
-
.
.
.
.

Generation = 126, Population = 0.
.
-
.
.
.
.

Generation = 168, Population = 0.
.
-
.
.
.
.

*** Life<Cell> 5x9 ***

Generation = 0, Population = 5.
0----0---
-----0--0
---------
---------
-------0-

Generation = 59, Population = 2.
.........
..-......
..1......
..-0.....
.........

Generation = 118, Population = 1.
.........
..-......
..-......
..0-.....
.........

Generation = 177, Population = 1.
.........
..-......
..-......
..-0.....
.........

Generation = 236, Population = 2.
.........
..1......
..-......
..0-.....
.........

*** Life<Cell> 8x6 ***

Generation = 0, Population = 12.
-----0
-00---
00----
--00--
0-----
----0-
--0---
--00--

Generation = 86, Population = 0.
......
......
......
......
......
......
......
......

Generation = 172, Population = 0.
......
......
......
......
......
......
......
......

Generation = 258, Population = 0.
......
......
......
......
......
......
......
......

Generation = 344, Population = 0.
......
......
......
......
......
......
......
......

*** Life<Cell> 8x9 ***

Generation = 0, Population = 12.
00---00--
---00----
----0----
--00-----
---------
--0------
-----0-0-
---------

Generation = 64, Population = 12.
......*..
......*..
......**.
.........
..***..**
.........
......**.
......*..

Generation = 128, Population = 0.
.........
.........
.........
.........
.........
.........
.........
.........

*** Life<Cell> 14x19 ***

Generation = 0, Population = 16.
--0------0---------
------0------------
------------0------
---0---------------
--------------0----
-------------------
-------------------
--------0----------
--------0----------
-------------------
--0-------0--------
--------------0-0--
--0----------------
---00----0---------

Generation = 3, Population = 108.
---0100-0--110-----
0-01-0---0000------
----000--110-------
0---0110-00-----0--
-0-0-00-0------0-0-
--0-0--010----0-0--
---0--00*00--0-0---
--0--01010-0--0----
-0-0-0101-0---0-0--
0---0-00-0--00---0-
---010--00-010----0
--0110--0--01------
-01---00-0--0-----0
-11.*--1--0-00---0-

Generation = 6, Population = 93.
---0**11-01-.--1---
1-.----11----------
--*-00-00.-000-----
--0--1*.-1---------
0---0-10-0-1------0
---0---1----1-0-0--
0-------.1--------0
-01*01---01-0-.-0-0
----0-1-------*-1--
-00--100*110--0-0--
--0---0-1-----0-0--
00-*.1---0-0.1--0--
*0*1*-1-0-1---1----
-*-*.11*---0-.-0--0

Generation = 9, Population = 125.
---...-1--.-.-1---0
**..-11*-1.0-000-00
-*.-.---1.11-*-000-
--*-0-..**01-01-100
-0*-00--1*1-1000*0-
--0-1--*-10-1---0--
00----00**1--0-00--
1-*.1.1-1-*0-*.-*0-
1001*-.011-0*-.11--
0-11-.-0.1-1--0--00
--.-*-.0.-00*0.0-0-
1-1..-00.-.0.-00.00
.-.*.0.--0*0----00-
-*1....*11---.----0

Generation = 12, Population = 104.
-0-...-.****.*.*111
...**.*..-.11-.----
-..-.0*0*.-.-.*1.-0
0-.-**.**.1-.1--.-*
-1.0.-.--...1*-0*-1
-0.0.-1.*..1.-*-0--
0111-011...1-1-*.--
--..**.0--.--*.-*--
*--*.0*-*--..1..-0-
1.1-..*1...*1--0101
--*-.-*0*1.-.-..1-0
--1..*--.-.0.1*0..*
.-...-.01-*--0*0.-*
1.**....1--0-.--**-

Generation = 15, Population = 105.
-0-.***...**...**1.
.........1.*.0*0*0-
0..-.1.*..1*-*...*-
--*1**...**...--.*.
-..-.1.***.*..1-.0.
-0.1*0*....**-.1.00
*.*--0.*....*.-**0-
--.*...---.01..-.--
*-1..-.-*1-*....--*
*..*...**.*.*0-..*-
-.***-.....-.-*..0-
-0..*.1-*1*-.-*1*..
.0.*.0*.11*-*-*-*0*
-.....*..*00-*1-.*-

Generation = 18, Population = 97.
---...........*..-.
....*.**.1*..-.**10
1**-...*..-.1*...*.
*..-......**..11**.
-..*.*.*......1-.0*
0-...-....*..-.***.
..**-1.....***-..0-
-1***..*.-*1-*.1.-.
.1-**-.-..*..****1*
.*.....**..**1-*.*-
-....*..*..-**...1-
-*....*0...-.-.-...
.1.****.1*.*.**-*-.
1..***....**.*10..-

Generation = 21, Population = 99.
0--....**........1.
.**...**.*.*.0..*.*
1*.-.***..-*..****.
***-....*..*..*-...
1..*......**..*-*..
-*.**-...***....**.
....0-....*.***.*.1
*-...*...-.1-*.*.-.
*1*..-*-...*.....**
**..***.....*.-...-
-..**......0...***-
*.**...1..**.**1..*
*..*.....*.*.*.**1.
-***....*.*...*-*.-

Generation = 24, Population = 88.
01....***....**..1.
.....*.**....-**.**
-..-.....*-*......*
...1*.*....*.**-..*
.*..*.*....*...*.*.
-.*..**...*****.*..
..**1*.....**.*.**-
.-*..**..-**-.***1.
**...*.-....*.*....
...*..*.....*.-...1
1*..*.....**...*..-
.*.....-**.*.*.*...
*..........*.*.*...
-**.....*.*....-*.-

Generation = 27, Population = 96.
............**.....
.....****....1*....
-..-.*****-*.......
.***....*...*..-..*
.***....*.........*
-*****.**.*.......*
....1*..**.*..**.*-
.*.***...*....*..-.
*****.*1..*.*.*****
*...**...**.*.**..*
.*.**...**....*.*.1
..**...-...****.**.
.*.......***..*..*.
-*.............**.-

Generation = 30, Population = 83.
.............**....
..******....**.....
-.***.....-..**....
.*.............-...
*.*..***........*.*
-*****.**.......*..
*.*..*.*..*....*..1
**.......*......*1*
...........*...**.*
..*.***...........*
..***.*.*......**.*
....*.**.......**.*
*.*.....**....*..*.
1*.......********.-

Generation = 33, Population = 69.
..***.......*......
.....***...*.......
-...*.....-.**.....
....*.***...**.-...
..*.**..*......***.
0*.....*.*.........
*.......**....*....
..*..***.......*.**
...**..*........*.*
*..**............**
....**.**......**.*
...*...*.......*..*
..**..**...........
1.............****-

Generation = 36, Population = 76.
.....***...........
...**.**...........
-....*....******...
......**...****1*..
.**.****....**...*.
0**...*.***.....*..
..*....*.*.......*.
.......**.......**.
...*...*.......*.*.
...*.*.............
...*.**.......**...
..*...**.....***.**
..*.**........*.*.*
-..*...........***-

Generation = 39, Population = 79.
....**.....*.*.....
...*...............
-..*..*...*...*.**.
..*...*..**..*...*.
.*.*.......**..*...
.***...***.*....***
.......****........
........*.......*.*
...**..***.....*...
..***.........*.***
.*..........***.*.*
.***.**.....***..**
.**.***......*.*..*
-..**............*-

Generation = 42, Population = 71.
...*...............
...*......*...***..
-.**....****.....**
..***...*..**.....*
**.**...*..**.....*
.*.**....*.*....*..
..**......*.....*..
.......**.*......*.
..***.*...*......*.
.*...*.*.*.....***.
.......**.......**.
*.....*........**..
*...***............
-.***.............-

Generation = 45, Population = 58.
...................
........*.*...**...
-......**.*......**
......**..........*
**......*.**.......
*...*...****.......
.**.**.*.........**
.*....*...*........
.........**......**
..*.*...........***
...***.**........**
......**.......***.
...*..*............
-..*.*............-

Generation = 48, Population = 54.
...................
.......***.........
-................**
.****.*....**....**
.*****..*..........
*.****..**.........
...................
...................
....*.**.........*.
...*...........*.*.
..**.*..*.....*....
..**....*......*.*.
...*..**.......***.
-..**.**..........-

*** Life<Cell> 7x14 ***

Generation = 0, Population = 5.
0-------------
--------------
--------0-----
--0-0---------
--------------
0-------------
--------------

*** Life<Cell> 13x3 ***

Generation = 0, Population = 9.
0--
---
---
--0
---
---
-0-
--0
-0-
---
-0-
---
000

Generation = 101, Population = 0.
...
...
...
...
...
...
...
...
...
-.-
...
...
...

Generation = 202, Population = 0.
...
...
...
...
...
...
...
...
...
-.-
...
...
...

*** Life<Cell> 15x15 ***

Generation = 0, Population = 12.
-------------0-
------------0--
--0------------
0--------------
-------------0-
---------------
------0--------
---------------
-----------00--
-0-------------
---------------
----------0----
------------0--
-0-------------
---------------

*** Life<Cell> 1x3 ***

Generation = 0, Population = 2.
0-0

Generation = 52, Population = 0.
---

Generation = 104, Population = 0.
---

*** Life<Cell> 14x10 ***

Generation = 0, Population = 11.
--0-------
----------
----------
------0-0-
------0---
----------
0-----0---
---------0
----------
----------
-----0----
-----00---
-0--------
----------

Generation = 10, Population = 47.
---1*10.--
1-.--.1-.-
--.-***--*
*-.*.1....
*-**-1.*-*
-01--1.-.*
--....-1.-
-*-0-1.1..
..1-1-..*-
0-0-1--*1-
*-*.-*0.*.
.....-.-*-
-..--..---
-0*-**.-0-

Generation = 20, Population = 49.
**...-1.*-
*1*.-..*.-
*1.-.....*
.1*..-**.*
.1**-.....
-.*..***..
..*...*.**
-...*.....
**.**.....
**.1..0**.
*0....*...
.*.....*.-
.**--..-1-
..*.*..--1

Generation = 30, Population = 47.
.***.*..*.
*...*....*
..*......*
...******.
**.*-*....
-*....**..
**....*.*.
**.*..*.*.
...**.....
....**-...
.1....*...
...*...***
....*...-*
.....***-.

Generation = 40, Population = 7.
..........
..........
..........
..........
..........
*.*.......
*.*.......
.*........
..........
......*...
.-....*...
..........
..........
..........

Generation = 50, Population = 0.
..........
..........
..........
..........
..........
..........
..........
..........
..........
..........
.-........
..........
..........
..........

Generation = 60, Population = 0.
..........
..........
..........
..........
..........
..........
..........
..........
..........
..........
.-........
..........
..........
..........

Generation = 70, Population = 0.
..........
..........
..........
..........
..........
..........
..........
..........
..........
..........
.-........
..........
..........
..........

Generation = 80, Population = 0.
..........
..........
..........
..........
..........
..........
..........
..........
..........
..........
.-........
..........
..........
..........

Generation = 90, Population = 0.
..........
..........
..........
..........
..........
..........
..........
..........
..........
..........
.-........
..........
..........
..........

Generation = 100, Population = 0.
..........
..........
..........
..........
..........
..........
..........
..........
..........
..........
.-........
..........
..........
..........

Generation = 110, Population = 0.
..........
..........
..........
..........
..........
..........
..........
..........
..........
..........
.-........
..........
..........
..........

Generation = 120, Population = 0.
..........
..........
..........
..........
..........
..........
..........
..........
..........
..........
.-........
..........
..........
..........

Generation = 130, Population = 0.
..........
..........
..........
..........
..........
..........
..........
..........
..........
..........
.-........
..........
..........
..........

Generation = 140, Population = 0.
..........
..........
..........
..........
..........
..........
..........
..........
..........
..........
.-........
..........
..........
..........

Generation = 150, Population = 0.
..........
..........
..........
..........
..........
..........
..........
..........
..........
..........
.-........
..........
..........
..........

Generation = 160, Population = 0.
..........
..........
..........
..........
..........
..........
..........
..........
..........
..........
.-........
..........
..........
..........

*** Life<Cell> 17x14 ***

Generation = 0, Population = 7.
--------------
--------------
--------------
--------------
--------------
------------0-
--------------
--------0--0--
--------------
--0-----------
--0-----------
--------------
-------------0
--------------
------0-------
--------------
--------------

Generation = 126, Population = 19.
**.**.........
**.**.........
..............
..............
..............
..............
..............
..............
..............
..............
.***..........
..............
..............
..............
...-....-.....
-...**.....**.
....**.....**.

Generation = 252, Population = 19.
**.**.........
**.**.........
..............
..............
..............
..............
..............
..............
..............
..............
.***..........
..............
..............
..............
...-....-.....
-...**.....**.
....**.....**.

*** Life<Cell> 2x18 ***

Generation = 0, Population = 6.
00-----0----------
-----0-0---0------

Generation = 164, Population = 6.
...*-.........-.**
-..**.-.......-.-*

*** Life<Cell> 17x3 ***

Generation = 0, Population = 13.
-0-
---
0--
0--
0--
-00
---
---
---
0--
-0-
--0
--0
---
0--
---
-00

*** Life<Cell> 10x17 ***

Generation = 0, Population = 9.
---0-------------
-----------------
-----------------
---0-----------0-
--0------0-------
------0----------
---------0-------
-0---------------
-----------------
-0---------------

Generation = 48, Population = 14.
.-.............*-
..............*.*
...**.......-..**
...**............
..........-......
.............**..
.............**..
........1-.-.....
......-.....-....
............--...

Generation = 96, Population = 14.
.-.............*-
..............*.*
...**.......-..**
...**............
..........-......
.............**..
.............**..
........1-.-.....
......-.....-....
............--...

*** Life<Cell> 8x7 ***

Generation = 0, Population = 10.
--0----
0------
-------
--0---0
--0---0
-------
0----0-
--00---

*** Life<Cell> 19x7 ***

Generation = 0, Population = 11.
----0--
-------
-----0-
-------
0------
-----0-
--0----
-------
-------
-0-----
---0---
-------
-------
-------
-------
00-----
--0----
-------
-0-----

Generation = 17, Population = 49.
***....
-*-*..-
-..**..
-..**.*
...-*.*
-.1.-.1
-.-.**.
**1*..-
**1.*-.
.*.....
..*--*.
..*.--.
.***-.1
****-*1
-...-.*
....**1
.-0*..-
-..**.-
-..***.

Generation = 34, Population = 33.
...***.
..*..*-
.......
....*..
....***
...***.
....*.*
....***
.....**
.......
.......
.......
.....*.
...**.*
*.**.**
**...*.
.**....
-......
.......

Generation = 51, Population = 8.
.......
.......
....**.
....**.
.......
.......
.......
.......
.......
.......
.......
.......
.......
.......
**.....
**.....
.......
.......
.......

Generation = 68, Population = 8.
.......
.......
....**.
....**.
.......
.......
.......
.......
.......
.......
.......
.......
.......
.......
**.....
**.....
.......
.......
.......

Generation = 85, Population = 8.
.......
.......
....**.
....**.
.......
.......
.......
.......
.......
.......
.......
.......
.......
.......
**.....
**.....
.......
.......
.......

Generation = 102, Population = 8.
.......
.......
....**.
....**.
.......
.......
.......
.......
.......
.......
.......
.......
.......
.......
**.....
**.....
.......
.......
.......

Generation = 119, Population = 8.
.......
.......
....**.
....**.
.......
.......
.......
.......
.......
.......
.......
.......
.......
.......
**.....
**.....
.......
.......
.......

Generation = 136, Population = 8.
.......
.......
....**.
....**.
.......
.......
.......
.......
.......
.......
.......
.......
.......
.......
**.....
**.....
.......
.......
.......

Generation = 153, Population = 8.
.......
.......
....**.
....**.
.......
.......
.......
.......
.......
.......
.......
.......
.......
.......
**.....
**.....
.......
.......
.......

Generation = 170, Population = 8.
.......
.......
....**.
....**.
.......
.......
.......
.......
.......
.......
.......
.......
.......
.......
**.....
**.....
.......
.......
.......

Generation = 187, Population = 8.
.......
.......
....**.
....**.
.......
.......
.......
.......
.......
.......
.......
.......
.......
.......
**.....
**.....
.......
.......
.......

Generation = 204, Population = 8.
.......
.......
....**.
....**.
.......
.......
.......
.......
.......
.......
.......
.......
.......
.......
**.....
**.....
.......
.......
.......

Generation = 221, Population = 8.
.......
.......
....**.
....**.
.......
.......
.......
.......
.......
.......
.......
.......
.......
.......
**.....
**.....
.......
.......
.......

Generation = 238, Population = 8.
.......
.......
....**.
....**.
.......
.......
.......
.......
.......
.......
.......
.......
.......
.......
**.....
**.....
.......
.......
.......

Generation = 255, Population = 8.
.......
.......
....**.
....**.
.......
.......
.......
.......
.......
.......
.......
.......
.......
.......
**.....
**.....
.......
.......
.......

Generation = 272, Population = 8.
.......
.......
....**.
....**.
.......
.......
.......
.......
.......
.......
.......
.......
.......
.......
**.....
**.....
.......
.......
.......

Generation = 289, Population = 8.
.......
.......
....**.
....**.
.......
.......
.......
.......
.......
.......
.......
.......
.......
.......
**.....
**.....
.......
.......
.......

Generation = 306, Population = 8.
.......
.......
....**.
....**.
.......
.......
.......
.......
.......
.......
.......
.......
.......
.......
**.....
**.....
.......
.......
.......

Generation = 323, Population = 8.
.......
.......
....**.
....**.
.......
.......
.......
.......
.......
.......
.......
.......
.......
.......
**.....
**.....
.......
.......
.......

Generation = 340, Population = 8.
.......
.......
....**.
....**.
.......
.......
.......
.......
.......
.......
.......
.......
.......
.......
**.....
**.....
.......
.......
.......

Generation = 357, Population = 8.
.......
.......
....**.
....**.
.......
.......
.......
.......
.......
.......
.......
.......
.......
.......
**.....
**.....
.......
.......
.......

Generation = 374, Population = 8.
.......
.......
....**.
....**.
.......
.......
.......
.......
.......
.......
.......
.......
.......
.......
**.....
**.....
.......
.......
.......

*** Life<Cell> 8x1 ***

Generation = 0, Population = 8.
0
0
0
0
0
0
0
0

*** Life<Cell> 3x11 ***

Generation = 0, Population = 13.
0--00-000--
0------0-0-
-0------000

Generation = 89, Population = 1.
..........-
........-.0
-..........

Generation = 178, Population = 1.
..........1
........-.-
-..........

Generation = 267, Population = 1.
..........-
........-.0
-..........

*** Life<Cell> 12x2 ***

Generation = 0, Population = 6.
-0
-0
--
-0
--
--
--
--
--
00
--
-0

Generation = 183, Population = 6.
-.
..
-.
..
-.
..
-.
..
-*
**
-1
**

