27

96 73
1
r 41 60 w
20 160

96 100
3
t 34 67 e
t 41 45 w
t 29 12 n
20 133

43 12
4
h 2 8 s
t 42 0 w
t 25 8 n
f 4 11 n
264 188

6 10
5
t 3 5 n
t 3 6 w
t 2 5 n
h 1 5 e
r 3 7 e
818 129

59 35
5
h 13 22 e
t 17 8 n
t 52 19 e
r 0 31 s
r 42 21 n
72 101

28 61
4
f 24 54 w
f 27 18 e
h 27 58 w
h 4 1 n
815 52

56 57
2
f 46 11 e
h 3 52 e
488 122

13 88
3
t 6 82 n
t 3 26 n
r 8 71 w
930 106

58 48
6
t 2 27 w
h 5 27 e
f 51 12 w
r 42 36 s
t 26 24 s
f 23 42 n
122 136

17 11
4
t 0 7 e
h 8 3 e
h 13 1 s
h 4 2 s
33 104

83 82
8
r 12 80 w
h 67 53 e
t 14 61 e
r 17 14 e
h 72 39 e
h 62 73 e
h 16 38 w
h 9 72 n
785 129

36 23
2
r 1 13 w
t 35 6 w
479 166

70 63
3
f 56 57 n
f 51 11 e
f 12 28 e
575 192

52 15
9
r 9 7 e
f 42 5 e
h 48 0 s
f 21 7 n
r 23 13 e
t 45 13 s
h 10 0 s
t 2 5 e
r 42 6 s
203 177

96 28
8
t 69 22 e
r 93 11 w
f 86 15 n
t 85 11 n
h 35 17 w
r 9 14 e
r 4 24 e
h 10 19 w
580 83

24 23
3
r 21 13 e
f 12 4 e
f 2 1 e
608 99

13 43
4
f 7 38 s
t 1 3 w
h 6 6 n
h 12 41 e
395 109

70 49
9
t 0 30 w
r 29 31 w
t 53 24 s
r 41 24 n
t 8 37 w
t 26 30 n
r 53 14 s
t 24 4 s
f 24 10 w
275 195

4 30
1
t 2 9 w
267 134

22 30
6
h 3 26 e
t 19 11 s
h 15 27 s
r 14 20 n
f 3 7 n
t 3 3 s
6 125

89 57
3
h 12 2 e
r 84 22 s
h 53 41 s
157 112

56 87
1
r 51 33 n
145 127

7 73
9
h 5 44 w
r 5 30 s
f 4 18 e
t 6 70 w
f 0 27 s
r 6 12 s
h 1 8 w
h 4 65 e
r 2 13 n
795 84

48 4
8
t 26 3 s
t 40 1 e
f 23 2 s
f 5 3 w
t 10 0 w
t 1 2 n
t 26 0 e
t 15 3 e
522 72

15 86
9
h 3 20 n
t 0 21 n
r 4 27 s
t 14 45 n
t 0 16 n
f 3 46 n
f 3 21 w
t 9 49 s
h 3 19 s
340 56

8 80
10
f 1 8 w
t 1 44 n
t 6 33 e
t 0 11 e
f 0 36 e
f 7 62 n
h 2 77 s
f 4 72 w
f 0 50 n
r 4 50 e
456 66

81 65
2
r 10 35 s
h 10 37 s
614 101
