20

3
-1
5
2
-2

2
4
-1
7
-2
1
-1

5
6
3
8
-1
-1
4
-2
-1

4
-1
7
3
-2
6
2
-3
5

5
-1
4
-1
7
-1
8
-1

3
6
-1
5
-2
9
-2

4
7
-1
10
3
-3
8
-1

6
2
-1
4
11
5
12
-4

8
9
-2
13
-2
3
14
-3
6
16
-1

7
17
-1
5
-2
18
19
-3
3
-2

4
20
-1
7
-2
4
-1
21
-2

5
8
-1
9
-2
22
10
-3
23
-2
11
-1

3
12
13
-2
6
-3
-1
-1

6
24
-1
14
-2
26
-2
27
-1
-1

5
16
17
18
19
3
-1
-1
-1
-1
-1
-1

3
30
-1
20
14
-1
-1
-1

4
5
-1
6
-2
7
-1
8
-1

6
7
-1
8
-2
9
10
11
-4
12
-2

5
6
7
-2
-2
-1
8
9
-1

4
10
-1
11
12
-2
13
-3
14
