{
  "project_info": {
    "project_number": "109573149116",
    "firebase_url": "https://audiostreamingapp-bc724.firebaseio.com",
    "project_id": "audiostreamingapp-bc724",
    "storage_bucket": "audiostreamingapp-bc724.appspot.com"
  },
  "client": [
    {
      "client_info": {
        "mobilesdk_app_id": "1:109573149116:android:cbb070feeeedc4201f5bb9",
        "android_client_info": {
          "package_name": "io.ionic.starter"
        }
      },
      "oauth_client": [
        {
          "client_id": "109573149116-nqee4p6qhar7oii4s77qb3723ttscohc.apps.googleusercontent.com",
          "client_type": 3
        }
      ],
      "api_key": [
        {
          "current_key": "AIzaSyDjfRl0o3vMXNSg9Ek2HwbPY-fI0Qp81x8"
        }
      ],
      "services": {
        "appinvite_service": {
          "other_platform_oauth_client": [
            {
              "client_id": "109573149116-nqee4p6qhar7oii4s77qb3723ttscohc.apps.googleusercontent.com",
              "client_type": 3
            }
          ]
        }
      }
    }
  ],
  "configuration_version": "1"
}