{
  "resource": "v1/Feeds/Comments",
  "resource_explanation": null,
  "http_method": "POST",
  "route": "/api/v1/feeds/:feed_id/comments",
  "description": "Create comment",
  "explanation": null,
  "parameters": [
    {
      "required": true,
      "name": "feed_id",
      "description": "Feed Id for comments"
    },
    {
      "required": true,
      "name": "text",
      "description": "Comment text"
    }
  ],
  "response_fields": [

  ],
  "requests": [
    {
      "request_method": "POST",
      "request_path": "/api/v1/feeds/1178/comments",
      "request_body": "{\"text\":\"Some text\"}",
      "request_headers": {
        "Accept": "application/json",
        "Content-Type": "application/json",
        "X-Auth-Token": "po13BCnUt9m4neo3Xiefdubk",
        "Host": "example.org",
        "Cookie": ""
      },
      "request_query_parameters": {
      },
      "request_content_type": "application/json",
      "response_status": 201,
      "response_status_text": "Created",
      "response_body": "[\n  {\n    \"id\": 384,\n    \"text\": \"Some text\",\n    \"status\": \"Unread\",\n    \"created_at\": \"2020-02-10T09:00:13.438+00:00\",\n    \"user\": {\n      \"id\": 7586,\n      \"first_name\": \"Bryce\",\n      \"last_name\": \"Greenholt\",\n      \"grade\": 2016,\n      \"bio\": \"Nulla magnam optio quidem.\",\n      \"gender\": \"male\",\n      \"blocked\": false,\n      \"role\": \"ordinary\",\n      \"chat_available\": false,\n      \"custom_prop_available\": false,\n      \"friends_count\": 0,\n      \"pokes_count\": 0,\n      \"friendship_status\": null,\n      \"school_name\": \"Vel in eius assumenda.\"\n    },\n    \"chat\": null\n  }\n]",
      "response_headers": {
        "Content-Type": "application/json; charset=utf-8",
        "Vary": "Accept-Encoding",
        "ETag": "W/\"5b2206e7c526e17edc90bb022723f11f\"",
        "Cache-Control": "max-age=0, private, must-revalidate",
        "X-Request-Id": "e47957dd-efc7-4998-ac3e-d0a9cc4c09d6",
        "X-Runtime": "0.914058",
        "Set-Cookie": "__profilin=p%3Dt; path=/; HttpOnly",
        "Content-Length": "419"
      },
      "response_content_type": "application/json; charset=utf-8",
      "curl": null,
      "request_headers_text": "Accept: application/json\nContent-Type: application/json\nX-Auth-Token: po13BCnUt9m4neo3Xiefdubk\nHost: example.org\nCookie: ",
      "request_query_parameters_text": null,
      "response_headers_text": "Content-Type: application/json; charset=utf-8\nVary: Accept-Encoding\nETag: W/\"5b2206e7c526e17edc90bb022723f11f\"\nCache-Control: max-age=0, private, must-revalidate\nX-Request-Id: e47957dd-efc7-4998-ac3e-d0a9cc4c09d6\nX-Runtime: 0.914058\nSet-Cookie: __profilin=p%3Dt; path=/; HttpOnly\nContent-Length: 419"
    }
  ]
}