{
  "resource": "v1/Random friends",
  "resource_explanation": null,
  "http_method": "GET",
  "route": "/api/v1/random_friends",
  "description": "List of random friends",
  "explanation": null,
  "parameters": [

  ],
  "response_fields": [

  ],
  "requests": [
    {
      "request_method": "GET",
      "request_path": "/api/v1/random_friends",
      "request_body": null,
      "request_headers": {
        "Accept": "application/json",
        "Content-Type": "application/json",
        "X-Auth-Token": "wC3qpgoJTPRDVeEMeUiNjrQv",
        "Host": "example.org",
        "Cookie": ""
      },
      "request_query_parameters": {
      },
      "request_content_type": "application/json",
      "response_status": 200,
      "response_status_text": "OK",
      "response_body": "[\n  {\n    \"id\": 8117,\n    \"first_name\": \"Gerard\",\n    \"last_name\": \"Davis\",\n    \"grade\": 2011,\n    \"bio\": \"Earum in blanditiis officiis.\",\n    \"school_name\": \"Est impedit dolor ad.\",\n    \"avatar\": null,\n    \"default_avatar\": {\n      \"original\": \"http://example.org/assets/avatars/avatar-7.png\",\n      \"small\": \"http://example.org/assets/small-avatars/avatar-7.png\",\n      \"medium\": \"http://example.org/assets/medium-avatars/avatar-7.png\",\n      \"large\": \"http://example.org/assets/large-avatars/avatar-7.png\"\n    },\n    \"gender\": \"male\",\n    \"followee\": true,\n    \"blocked\": false,\n    \"role\": \"ordinary\",\n    \"chat_available\": false,\n    \"custom_prop_available\": false,\n    \"friends_count\": 0,\n    \"pokes_count\": 0,\n    \"hide_top_pokes\": false,\n    \"friendship_status\": \"uninvited\"\n  },\n  {\n    \"id\": 8119,\n    \"first_name\": \"Diego\",\n    \"last_name\": \"Willms\",\n    \"grade\": 2013,\n    \"bio\": \"Harum eos explicabo qui.\",\n    \"school_name\": \"Quia architecto quos ratione.\",\n    \"avatar\": null,\n    \"default_avatar\": {\n      \"original\": \"http://example.org/assets/avatars/avatar-18.png\",\n      \"small\": \"http://example.org/assets/small-avatars/avatar-18.png\",\n      \"medium\": \"http://example.org/assets/medium-avatars/avatar-18.png\",\n      \"large\": \"http://example.org/assets/large-avatars/avatar-18.png\"\n    },\n    \"gender\": \"non_binary\",\n    \"followee\": true,\n    \"blocked\": false,\n    \"role\": \"ordinary\",\n    \"chat_available\": false,\n    \"custom_prop_available\": false,\n    \"friends_count\": 0,\n    \"pokes_count\": 0,\n    \"hide_top_pokes\": false,\n    \"friendship_status\": \"uninvited\"\n  },\n  {\n    \"id\": 8120,\n    \"first_name\": \"Chante\",\n    \"last_name\": \"Dietrich\",\n    \"grade\": 2011,\n    \"bio\": \"Repellat sit et dolorum.\",\n    \"school_name\": \"Temporibus molestias laudantium nihil.\",\n    \"avatar\": null,\n    \"default_avatar\": {\n      \"original\": \"http://example.org/assets/avatars/avatar-7.png\",\n      \"small\": \"http://example.org/assets/small-avatars/avatar-7.png\",\n      \"medium\": \"http://example.org/assets/medium-avatars/avatar-7.png\",\n      \"large\": \"http://example.org/assets/large-avatars/avatar-7.png\"\n    },\n    \"gender\": \"female\",\n    \"followee\": true,\n    \"blocked\": false,\n    \"role\": \"ordinary\",\n    \"chat_available\": false,\n    \"custom_prop_available\": false,\n    \"friends_count\": 0,\n    \"pokes_count\": 0,\n    \"hide_top_pokes\": false,\n    \"friendship_status\": \"uninvited\"\n  },\n  {\n    \"id\": 8118,\n    \"first_name\": \"Van\",\n    \"last_name\": \"Prosacco\",\n    \"grade\": 2014,\n    \"bio\": \"Repudiandae blanditiis repellendus assumenda.\",\n    \"school_name\": \"Ullam officiis consequatur itaque.\",\n    \"avatar\": null,\n    \"default_avatar\": {\n      \"original\": \"http://example.org/assets/avatars/avatar-25.png\",\n      \"small\": \"http://example.org/assets/small-avatars/avatar-25.png\",\n      \"medium\": \"http://example.org/assets/medium-avatars/avatar-25.png\",\n      \"large\": \"http://example.org/assets/large-avatars/avatar-25.png\"\n    },\n    \"gender\": \"male\",\n    \"followee\": true,\n    \"blocked\": false,\n    \"role\": \"ordinary\",\n    \"chat_available\": false,\n    \"custom_prop_available\": false,\n    \"friends_count\": 0,\n    \"pokes_count\": 0,\n    \"hide_top_pokes\": false,\n    \"friendship_status\": \"uninvited\"\n  },\n  {\n    \"id\": 8116,\n    \"first_name\": \"Demetrius\",\n    \"last_name\": \"Mueller\",\n    \"grade\": 2021,\n    \"bio\": \"Quos ducimus voluptatem beatae.\",\n    \"school_name\": \"Ratione nostrum ex ipsa.\",\n    \"avatar\": null,\n    \"default_avatar\": {\n      \"original\": \"http://example.org/assets/avatars/avatar-16.png\",\n      \"small\": \"http://example.org/assets/small-avatars/avatar-16.png\",\n      \"medium\": \"http://example.org/assets/medium-avatars/avatar-16.png\",\n      \"large\": \"http://example.org/assets/large-avatars/avatar-16.png\"\n    },\n    \"gender\": \"female\",\n    \"followee\": true,\n    \"blocked\": false,\n    \"role\": \"ordinary\",\n    \"chat_available\": false,\n    \"custom_prop_available\": false,\n    \"friends_count\": 0,\n    \"pokes_count\": 0,\n    \"hide_top_pokes\": false,\n    \"friendship_status\": \"uninvited\"\n  }\n]",
      "response_headers": {
        "Content-Type": "application/json; charset=utf-8",
        "Vary": "Accept-Encoding",
        "ETag": "W/\"7a74986e822582800f465e7337bc29d6\"",
        "Cache-Control": "max-age=0, private, must-revalidate",
        "X-Request-Id": "5afc623c-863b-43c8-9ba2-4589e1e28299",
        "X-Runtime": "0.140004",
        "Set-Cookie": "__profilin=p%3Dt; path=/; HttpOnly",
        "Content-Length": "3255"
      },
      "response_content_type": "application/json; charset=utf-8",
      "curl": null,
      "request_headers_text": "Accept: application/json\nContent-Type: application/json\nX-Auth-Token: wC3qpgoJTPRDVeEMeUiNjrQv\nHost: example.org\nCookie: ",
      "request_query_parameters_text": null,
      "response_headers_text": "Content-Type: application/json; charset=utf-8\nVary: Accept-Encoding\nETag: W/\"7a74986e822582800f465e7337bc29d6\"\nCache-Control: max-age=0, private, must-revalidate\nX-Request-Id: 5afc623c-863b-43c8-9ba2-4589e1e28299\nX-Runtime: 0.140004\nSet-Cookie: __profilin=p%3Dt; path=/; HttpOnly\nContent-Length: 3255"
    }
  ]
}