{
  "resource": "v1/Suggest props",
  "resource_explanation": null,
  "http_method": "POST",
  "route": "/api/v1/suggest_props",
  "description": "Suggest a prop",
  "explanation": null,
  "parameters": [
    {
      "required": true,
      "name": "content",
      "description": "Suggested prop content"
    },
    {
      "name": "emoji",
      "description": "Suggested prop emoji"
    }
  ],
  "response_fields": [

  ],
  "requests": [
    {
      "request_method": "POST",
      "request_path": "/api/v1/suggest_props",
      "request_body": "{\"content\":\"Autem commodi enim non.\",\"emoji\":\"🌺\"}",
      "request_headers": {
        "Accept": "application/json",
        "Content-Type": "application/json",
        "X-Auth-Token": "CzJEhZvpiCoMCyeVhe1Zn6jt",
        "Host": "example.org",
        "Cookie": ""
      },
      "request_query_parameters": {
      },
      "request_content_type": "application/json",
      "response_status": 204,
      "response_status_text": "No Content",
      "response_body": null,
      "response_headers": {
        "Cache-Control": "no-cache",
        "X-Request-Id": "eef64d1e-2870-485b-9543-cfd0708693af",
        "X-Runtime": "0.062894",
        "Set-Cookie": "__profilin=p%3Dt; path=/; HttpOnly"
      },
      "response_content_type": null,
      "curl": null,
      "request_headers_text": "Accept: application/json\nContent-Type: application/json\nX-Auth-Token: CzJEhZvpiCoMCyeVhe1Zn6jt\nHost: example.org\nCookie: ",
      "request_query_parameters_text": null,
      "response_headers_text": "Cache-Control: no-cache\nX-Request-Id: eef64d1e-2870-485b-9543-cfd0708693af\nX-Runtime: 0.062894\nSet-Cookie: __profilin=p%3Dt; path=/; HttpOnly"
    }
  ]
}