{
  "resource": "v1/Feedback",
  "resource_explanation": null,
  "http_method": "POST",
  "route": "/api/v1/feedbacks",
  "description": "Send feedback",
  "explanation": null,
  "parameters": [
    {
      "required": true,
      "name": "text",
      "description": "Feedback text"
    }
  ],
  "response_fields": [

  ],
  "requests": [
    {
      "request_method": "POST",
      "request_path": "/api/v1/feedbacks",
      "request_body": "{\"text\":\"Facere vero recusandae illo.\"}",
      "request_headers": {
        "Accept": "application/json",
        "Content-Type": "application/json",
        "X-Auth-Token": "QVt6ftmQ4rpdUrwVaZ1Au4sD",
        "Host": "example.org",
        "Cookie": ""
      },
      "request_query_parameters": {
      },
      "request_content_type": "application/json",
      "response_status": 204,
      "response_status_text": "No Content",
      "response_body": null,
      "response_headers": {
        "Cache-Control": "no-cache",
        "X-Request-Id": "34141d67-25d2-4cc9-8388-ca714fafa651",
        "X-Runtime": "0.056958",
        "Set-Cookie": "__profilin=p%3Dt; path=/; HttpOnly"
      },
      "response_content_type": null,
      "curl": null,
      "request_headers_text": "Accept: application/json\nContent-Type: application/json\nX-Auth-Token: QVt6ftmQ4rpdUrwVaZ1Au4sD\nHost: example.org\nCookie: ",
      "request_query_parameters_text": null,
      "response_headers_text": "Cache-Control: no-cache\nX-Request-Id: 34141d67-25d2-4cc9-8388-ca714fafa651\nX-Runtime: 0.056958\nSet-Cookie: __profilin=p%3Dt; path=/; HttpOnly"
    }
  ]
}