{
  "resource": "v1/PubNub key set",
  "resource_explanation": null,
  "http_method": "GET",
  "route": "/api/v1/pubnub_key_set",
  "description": "get actual pubnub key set",
  "explanation": null,
  "parameters": [

  ],
  "response_fields": [

  ],
  "requests": [
    {
      "request_method": "GET",
      "request_path": "/api/v1/pubnub_key_set",
      "request_body": null,
      "request_headers": {
        "Accept": "application/json",
        "Content-Type": "application/json",
        "X-Auth-Token": "8kSthpxNo3yf1adbqY9w4g5H",
        "Host": "example.org",
        "Cookie": ""
      },
      "request_query_parameters": {
      },
      "request_content_type": "application/json",
      "response_status": 200,
      "response_status_text": "OK",
      "response_body": "{\n  \"pubnub_publish_key\": \"hakuna\",\n  \"pubnub_subscribe_key\": \"matata\"\n}",
      "response_headers": {
        "Content-Type": "application/json; charset=utf-8",
        "Vary": "Accept-Encoding",
        "ETag": "W/\"dba28adc300360782a6db94478558344\"",
        "Cache-Control": "max-age=0, private, must-revalidate",
        "X-Request-Id": "753ce795-f8fa-4b3d-8e8e-4a90d0aa878e",
        "X-Runtime": "0.033306",
        "Set-Cookie": "__profilin=p%3Dt; path=/; HttpOnly",
        "Content-Length": "63"
      },
      "response_content_type": "application/json; charset=utf-8",
      "curl": null,
      "request_headers_text": "Accept: application/json\nContent-Type: application/json\nX-Auth-Token: 8kSthpxNo3yf1adbqY9w4g5H\nHost: example.org\nCookie: ",
      "request_query_parameters_text": null,
      "response_headers_text": "Content-Type: application/json; charset=utf-8\nVary: Accept-Encoding\nETag: W/\"dba28adc300360782a6db94478558344\"\nCache-Control: max-age=0, private, must-revalidate\nX-Request-Id: 753ce795-f8fa-4b3d-8e8e-4a90d0aa878e\nX-Runtime: 0.033306\nSet-Cookie: __profilin=p%3Dt; path=/; HttpOnly\nContent-Length: 63"
    }
  ]
}