{
  "resource": "v1/My/Feeds",
  "resource_explanation": null,
  "http_method": "GET",
  "route": "/api/v1/my/feeds",
  "description": "Count of engaged friends",
  "explanation": null,
  "parameters": [
    {
      "name": "page",
      "description": "Page number"
    },
    {
      "name": "per_page",
      "description": "Per page"
    }
  ],
  "response_fields": [

  ],
  "requests": [
    {
      "request_method": "GET",
      "request_path": "/api/v1/my/feeds?page=1&per_page=5",
      "request_body": null,
      "request_headers": {
        "Accept": "application/json",
        "Content-Type": "application/json",
        "X-Auth-Token": "UT5kVam5QQiASgpbENtdQ96D",
        "Host": "example.org",
        "Cookie": ""
      },
      "request_query_parameters": {
        "page": "1",
        "per_page": "5"
      },
      "request_content_type": "application/json",
      "response_status": 200,
      "response_status_text": "OK",
      "response_body": "[\n  {\n    \"id\": 1260,\n    \"image\": null,\n    \"user_id\": 7924,\n    \"incognito\": false,\n    \"likes_count\": 0,\n    \"liked\": false,\n    \"created_at\": \"2020-02-09T09:00:28.584+00:00\",\n    \"unread_comments_count\": 0,\n    \"text\": null,\n    \"link\": null,\n    \"count_of_engaged_friends\": 0,\n    \"comments_count\": 0,\n    \"reposted\": false,\n    \"source_feed_id\": null,\n    \"chat\": {\n      \"id\": 571,\n      \"pubnub_channel_name\": \"chat_571\",\n      \"updated_at\": \"2020-02-10T09:00:28.649+00:00\",\n      \"incognito\": false,\n      \"feed_id\": 1260,\n      \"comment_id\": null,\n      \"name\": null,\n      \"is_group\": true,\n      \"owner\": {\n        \"id\": 7923,\n        \"first_name\": \"Frederic\",\n        \"last_name\": \"Bashirian\",\n        \"grade\": 2025,\n        \"bio\": \"Sint fugit quam illo.\",\n        \"school_name\": \"Qui laboriosam labore iusto.\",\n        \"avatar\": null,\n        \"default_avatar\": {\n          \"original\": \"http://example.org/assets/avatars/avatar-23.png\",\n          \"small\": \"http://example.org/assets/small-avatars/avatar-23.png\",\n          \"medium\": \"http://example.org/assets/medium-avatars/avatar-23.png\",\n          \"large\": \"http://example.org/assets/large-avatars/avatar-23.png\"\n        },\n        \"gender\": \"non_binary\",\n        \"followee\": false,\n        \"blocked\": false,\n        \"role\": \"ordinary\",\n        \"chat_available\": false,\n        \"custom_prop_available\": false,\n        \"friends_count\": 2,\n        \"pokes_count\": 0,\n        \"hide_top_pokes\": false,\n        \"friendship_status\": null\n      },\n      \"users\": [\n\n      ],\n      \"deanonymizations\": [\n\n      ]\n    }\n  },\n  {\n    \"id\": 1262,\n    \"image\": null,\n    \"user_id\": 7924,\n    \"incognito\": false,\n    \"likes_count\": 0,\n    \"liked\": false,\n    \"created_at\": \"2020-02-08T09:00:28.592+00:00\",\n    \"unread_comments_count\": 0,\n    \"text\": null,\n    \"link\": null,\n    \"count_of_engaged_friends\": 0,\n    \"comments_count\": 0,\n    \"reposted\": false,\n    \"source_feed_id\": null,\n    \"chat\": null\n  },\n  {\n    \"id\": 1261,\n    \"image\": null,\n    \"user_id\": 7923,\n    \"incognito\": false,\n    \"likes_count\": 1,\n    \"liked\": false,\n    \"created_at\": \"2020-02-07T09:00:28.589+00:00\",\n    \"unread_comments_count\": 1,\n    \"text\": null,\n    \"link\": null,\n    \"count_of_engaged_friends\": 2,\n    \"comments_count\": 1,\n    \"reposted\": false,\n    \"source_feed_id\": null,\n    \"chat\": null\n  }\n]",
      "response_headers": {
        "Content-Type": "application/json; charset=utf-8",
        "Vary": "Accept-Encoding",
        "ETag": "W/\"f6068548b3eb9e432529a0f51f3ab01a\"",
        "Cache-Control": "max-age=0, private, must-revalidate",
        "X-Request-Id": "433e24e5-7572-406c-9ccb-9bc3e0e29416",
        "X-Runtime": "0.127239",
        "Set-Cookie": "__profilin=p%3Dt; path=/; HttpOnly",
        "Content-Length": "1695"
      },
      "response_content_type": "application/json; charset=utf-8",
      "curl": null,
      "request_headers_text": "Accept: application/json\nContent-Type: application/json\nX-Auth-Token: UT5kVam5QQiASgpbENtdQ96D\nHost: example.org\nCookie: ",
      "request_query_parameters_text": "page: 1\nper_page: 5",
      "response_headers_text": "Content-Type: application/json; charset=utf-8\nVary: Accept-Encoding\nETag: W/\"f6068548b3eb9e432529a0f51f3ab01a\"\nCache-Control: max-age=0, private, must-revalidate\nX-Request-Id: 433e24e5-7572-406c-9ccb-9bc3e0e29416\nX-Runtime: 0.127239\nSet-Cookie: __profilin=p%3Dt; path=/; HttpOnly\nContent-Length: 1695"
    }
  ]
}