{
  "resource": "v1/Interlocutors",
  "resource_explanation": null,
  "http_method": "GET",
  "route": "/api/v1/interlocutors",
  "description": "List of friends",
  "explanation": null,
  "parameters": [
    {
      "name": "page",
      "description": "Page number"
    },
    {
      "name": "per_page",
      "description": "Per page"
    },
    {
      "name": "keywords",
      "description": "Full name search keywords"
    }
  ],
  "response_fields": [

  ],
  "requests": [
    {
      "request_method": "GET",
      "request_path": "/api/v1/interlocutors",
      "request_body": null,
      "request_headers": {
        "Accept": "application/json",
        "Content-Type": "application/json",
        "X-Auth-Token": "efQ9hX8r3yaVBRdyBG2YHA76",
        "Host": "example.org",
        "Cookie": ""
      },
      "request_query_parameters": {
      },
      "request_content_type": "application/json",
      "response_status": 200,
      "response_status_text": "OK",
      "response_body": "[\n  {\n    \"id\": 7774,\n    \"first_name\": \"Brad\",\n    \"last_name\": \"Pitt\",\n    \"grade\": 2030,\n    \"bio\": \"Et quibusdam maxime iste.\",\n    \"school_name\": \"Rerum odit sunt exercitationem.\",\n    \"avatar\": null,\n    \"default_avatar\": {\n      \"original\": \"http://example.org/assets/avatars/avatar-4.png\",\n      \"small\": \"http://example.org/assets/small-avatars/avatar-4.png\",\n      \"medium\": \"http://example.org/assets/medium-avatars/avatar-4.png\",\n      \"large\": \"http://example.org/assets/large-avatars/avatar-4.png\"\n    },\n    \"gender\": \"male\",\n    \"followee\": false,\n    \"blocked\": false,\n    \"role\": \"ordinary\",\n    \"chat_available\": true,\n    \"custom_prop_available\": true,\n    \"friends_count\": 1,\n    \"pokes_count\": 0,\n    \"hide_top_pokes\": false,\n    \"friendship_status\": \"friend\"\n  },\n  {\n    \"id\": 7775,\n    \"first_name\": \"George\",\n    \"last_name\": \"Clooney\",\n    \"grade\": 2014,\n    \"bio\": \"Velit ea sed minima.\",\n    \"school_name\": \"Labore in qui dicta.\",\n    \"avatar\": null,\n    \"default_avatar\": {\n      \"original\": \"http://example.org/assets/avatars/avatar-24.png\",\n      \"small\": \"http://example.org/assets/small-avatars/avatar-24.png\",\n      \"medium\": \"http://example.org/assets/medium-avatars/avatar-24.png\",\n      \"large\": \"http://example.org/assets/large-avatars/avatar-24.png\"\n    },\n    \"gender\": \"female\",\n    \"followee\": false,\n    \"blocked\": false,\n    \"role\": \"ordinary\",\n    \"chat_available\": true,\n    \"custom_prop_available\": true,\n    \"friends_count\": 1,\n    \"pokes_count\": 0,\n    \"hide_top_pokes\": false,\n    \"friendship_status\": \"friend\"\n  },\n  {\n    \"id\": 7776,\n    \"first_name\": \"Matt\",\n    \"last_name\": \"Damon\",\n    \"grade\": 2030,\n    \"bio\": \"Dolor nam omnis vel.\",\n    \"school_name\": \"Debitis aliquid ab distinctio.\",\n    \"avatar\": null,\n    \"default_avatar\": {\n      \"original\": \"http://example.org/assets/avatars/avatar-4.png\",\n      \"small\": \"http://example.org/assets/small-avatars/avatar-4.png\",\n      \"medium\": \"http://example.org/assets/medium-avatars/avatar-4.png\",\n      \"large\": \"http://example.org/assets/large-avatars/avatar-4.png\"\n    },\n    \"gender\": \"male\",\n    \"followee\": false,\n    \"blocked\": false,\n    \"role\": \"ordinary\",\n    \"chat_available\": true,\n    \"custom_prop_available\": true,\n    \"friends_count\": 1,\n    \"pokes_count\": 0,\n    \"hide_top_pokes\": false,\n    \"friendship_status\": \"friend\"\n  }\n]",
      "response_headers": {
        "Content-Type": "application/json; charset=utf-8",
        "Vary": "Accept-Encoding",
        "ETag": "W/\"5725f1863007c219975fa7e273b419a5\"",
        "Cache-Control": "max-age=0, private, must-revalidate",
        "X-Request-Id": "f3f94e4b-9372-483a-bd1a-87e5c28ba98b",
        "X-Runtime": "0.088023",
        "Set-Cookie": "__profilin=p%3Dt; path=/; HttpOnly",
        "Content-Length": "1893"
      },
      "response_content_type": "application/json; charset=utf-8",
      "curl": null,
      "request_headers_text": "Accept: application/json\nContent-Type: application/json\nX-Auth-Token: efQ9hX8r3yaVBRdyBG2YHA76\nHost: example.org\nCookie: ",
      "request_query_parameters_text": null,
      "response_headers_text": "Content-Type: application/json; charset=utf-8\nVary: Accept-Encoding\nETag: W/\"5725f1863007c219975fa7e273b419a5\"\nCache-Control: max-age=0, private, must-revalidate\nX-Request-Id: f3f94e4b-9372-483a-bd1a-87e5c28ba98b\nX-Runtime: 0.088023\nSet-Cookie: __profilin=p%3Dt; path=/; HttpOnly\nContent-Length: 1893"
    }
  ]
}