{
  "resource": "v1/My/OutContacts",
  "resource_explanation": null,
  "http_method": "GET",
  "route": "/api/v1/my/outline_contacts",
  "description": "List of outline contacts",
  "explanation": null,
  "parameters": [
    {
      "name": "page",
      "description": "Page number"
    },
    {
      "name": "per_page",
      "description": "Per page"
    }
  ],
  "response_fields": [

  ],
  "requests": [
    {
      "request_method": "GET",
      "request_path": "/api/v1/my/outline_contacts?page=1&per_page=5",
      "request_body": null,
      "request_headers": {
        "Accept": "application/json",
        "Content-Type": "application/json",
        "X-Auth-Token": "QA8W5rKxd5kQN8STKmmkxBWm",
        "Host": "example.org",
        "Cookie": ""
      },
      "request_query_parameters": {
        "page": "1",
        "per_page": "5"
      },
      "request_content_type": "application/json",
      "response_status": 200,
      "response_status_text": "OK",
      "response_body": "{\n  \"users\": [\n    {\n      \"id\": 177,\n      \"phone_number\": \"+11234567891\",\n      \"name\": null,\n      \"invited\": false\n    },\n    {\n      \"id\": 178,\n      \"phone_number\": \"+11234567892\",\n      \"name\": null,\n      \"invited\": false\n    }\n  ],\n  \"meta\": {\n    \"users_count\": 2\n  }\n}",
      "response_headers": {
        "Content-Type": "application/json; charset=utf-8",
        "Vary": "Accept-Encoding",
        "ETag": "W/\"8d4d972da1134e62b892b05e99fc174d\"",
        "Cache-Control": "max-age=0, private, must-revalidate",
        "X-Request-Id": "4aae003f-d1e0-4b33-8882-a45bf331311d",
        "X-Runtime": "0.050127",
        "Set-Cookie": "__profilin=p%3Dt; path=/; HttpOnly",
        "Content-Length": "174"
      },
      "response_content_type": "application/json; charset=utf-8",
      "curl": null,
      "request_headers_text": "Accept: application/json\nContent-Type: application/json\nX-Auth-Token: QA8W5rKxd5kQN8STKmmkxBWm\nHost: example.org\nCookie: ",
      "request_query_parameters_text": "page: 1\nper_page: 5",
      "response_headers_text": "Content-Type: application/json; charset=utf-8\nVary: Accept-Encoding\nETag: W/\"8d4d972da1134e62b892b05e99fc174d\"\nCache-Control: max-age=0, private, must-revalidate\nX-Request-Id: 4aae003f-d1e0-4b33-8882-a45bf331311d\nX-Runtime: 0.050127\nSet-Cookie: __profilin=p%3Dt; path=/; HttpOnly\nContent-Length: 174"
    }
  ]
}