{
  "resource": "v1/Request props",
  "resource_explanation": null,
  "http_method": "POST",
  "route": "/api/v1/requests",
  "description": "Request props",
  "explanation": null,
  "parameters": [

  ],
  "response_fields": [

  ],
  "requests": [
    {
      "request_method": "POST",
      "request_path": "/api/v1/requests",
      "request_body": null,
      "request_headers": {
        "Accept": "application/json",
        "Content-Type": "application/json",
        "X-Auth-Token": "SH2Cy8Afe7yXtVFHDEPNFoHd",
        "Host": "example.org",
        "Cookie": ""
      },
      "request_query_parameters": {
      },
      "request_content_type": "application/json",
      "response_status": 204,
      "response_status_text": "No Content",
      "response_body": null,
      "response_headers": {
        "Cache-Control": "no-cache",
        "X-Request-Id": "455c4f5b-33ae-4390-b6b9-e4914a9c186f",
        "X-Runtime": "0.045229",
        "Set-Cookie": "__profilin=p%3Dt; path=/; HttpOnly"
      },
      "response_content_type": null,
      "curl": null,
      "request_headers_text": "Accept: application/json\nContent-Type: application/json\nX-Auth-Token: SH2Cy8Afe7yXtVFHDEPNFoHd\nHost: example.org\nCookie: ",
      "request_query_parameters_text": null,
      "response_headers_text": "Cache-Control: no-cache\nX-Request-Id: 455c4f5b-33ae-4390-b6b9-e4914a9c186f\nX-Runtime: 0.045229\nSet-Cookie: __profilin=p%3Dt; path=/; HttpOnly"
    }
  ]
}