{
  "resource": "v1/Chats/Deanonymizations",
  "resource_explanation": null,
  "http_method": "POST",
  "route": "/api/v1/chats/:chat_id/deanonymizations",
  "description": "Create deanonymization",
  "explanation": null,
  "parameters": [
    {
      "required": true,
      "name": "chat_id",
      "description": "ID of chat where user wants to be deanonymized"
    }
  ],
  "response_fields": [

  ],
  "requests": [
    {
      "request_method": "POST",
      "request_path": "/api/v1/chats/527/deanonymizations",
      "request_body": null,
      "request_headers": {
        "Accept": "application/json",
        "Content-Type": "application/json",
        "X-Auth-Token": "6QEAsyJsPnpQnzB8FhHF8ni9",
        "Host": "example.org",
        "Cookie": ""
      },
      "request_query_parameters": {
      },
      "request_content_type": "application/json",
      "response_status": 201,
      "response_status_text": "Created",
      "response_body": "{\n  \"id\": 157,\n  \"user_id\": 7399\n}",
      "response_headers": {
        "Content-Type": "application/json; charset=utf-8",
        "Vary": "Accept-Encoding",
        "ETag": "W/\"a74aaab9d33e2259240a0106726b5ada\"",
        "Cache-Control": "max-age=0, private, must-revalidate",
        "X-Request-Id": "bcaa296e-7783-454d-9948-97b1329b0066",
        "X-Runtime": "0.099611",
        "Set-Cookie": "__profilin=p%3Dt; path=/; HttpOnly",
        "Content-Length": "25"
      },
      "response_content_type": "application/json; charset=utf-8",
      "curl": null,
      "request_headers_text": "Accept: application/json\nContent-Type: application/json\nX-Auth-Token: 6QEAsyJsPnpQnzB8FhHF8ni9\nHost: example.org\nCookie: ",
      "request_query_parameters_text": null,
      "response_headers_text": "Content-Type: application/json; charset=utf-8\nVary: Accept-Encoding\nETag: W/\"a74aaab9d33e2259240a0106726b5ada\"\nCache-Control: max-age=0, private, must-revalidate\nX-Request-Id: bcaa296e-7783-454d-9948-97b1329b0066\nX-Runtime: 0.099611\nSet-Cookie: __profilin=p%3Dt; path=/; HttpOnly\nContent-Length: 25"
    }
  ]
}