{
  "resource": "v1/Incoming requests",
  "resource_explanation": null,
  "http_method": "GET",
  "route": "/api/v1/incoming_requests/:id",
  "description": "Specific request",
  "explanation": null,
  "parameters": [
    {
      "required": true,
      "name": "id",
      "description": "Id of the incoming request"
    }
  ],
  "response_fields": [

  ],
  "requests": [
    {
      "request_method": "GET",
      "request_path": "/api/v1/incoming_requests/306",
      "request_body": null,
      "request_headers": {
        "Accept": "application/json",
        "Content-Type": "application/json",
        "X-Auth-Token": "EMykbtND7qAay7NfQgpkaMdu",
        "Host": "example.org",
        "Cookie": ""
      },
      "request_query_parameters": {
      },
      "request_content_type": "application/json",
      "response_status": 200,
      "response_status_text": "OK",
      "response_body": "{\n  \"id\": 306,\n  \"progress\": 0,\n  \"respondents_amount\": 5\n}",
      "response_headers": {
        "Content-Type": "application/json; charset=utf-8",
        "Vary": "Accept-Encoding",
        "ETag": "W/\"59e952393fb946b1e91a1f8169509339\"",
        "Cache-Control": "max-age=0, private, must-revalidate",
        "X-Request-Id": "6c7b1d4a-5613-444f-8766-771d0c548740",
        "X-Runtime": "0.009987",
        "Set-Cookie": "__profilin=p%3Dt; path=/; HttpOnly",
        "Content-Length": "46"
      },
      "response_content_type": "application/json; charset=utf-8",
      "curl": null,
      "request_headers_text": "Accept: application/json\nContent-Type: application/json\nX-Auth-Token: EMykbtND7qAay7NfQgpkaMdu\nHost: example.org\nCookie: ",
      "request_query_parameters_text": null,
      "response_headers_text": "Content-Type: application/json; charset=utf-8\nVary: Accept-Encoding\nETag: W/\"59e952393fb946b1e91a1f8169509339\"\nCache-Control: max-age=0, private, must-revalidate\nX-Request-Id: 6c7b1d4a-5613-444f-8766-771d0c548740\nX-Runtime: 0.009987\nSet-Cookie: __profilin=p%3Dt; path=/; HttpOnly\nContent-Length: 46"
    }
  ]
}