\relax 
\providecommand\babel@aux[2]{}
\@nameuse{bbl@beforestart}
\catcode `"\active 
\babel@aux{russian}{}
\@writefile{toc}{\contentsline {section}{Введение}{5}{}\protected@file@percent }
\@writefile{toc}{\contentsline {section}{\numberline {1}Обоснование выбора темы}{6}{}\protected@file@percent }
\@writefile{toc}{\contentsline {section}{\numberline {2}Исследовательская часть}{8}{}\protected@file@percent }
\@writefile{toc}{\contentsline {subsection}{\numberline {2.1}Стилистические решения в традиционной анимации}{8}{}\protected@file@percent }
\@writefile{lof}{\contentsline {figure}{\numberline {1}{\ignorespaces Производство анимации с использованием целлулоида\relax }}{9}{}\protected@file@percent }
\@writefile{lof}{\contentsline {figure}{\numberline {2}{\ignorespaces Кадр аниме на бумаге и целлулоиде\relax }}{10}{}\protected@file@percent }
\@writefile{lof}{\contentsline {figure}{\numberline {4}{\ignorespaces Страницы из официального Style Guide для анимационного фильма Мулан\relax }}{11}{}\protected@file@percent }
\@writefile{lof}{\contentsline {figure}{\numberline {5}{\ignorespaces Ранние концепты персонажей для анимационного фильма Алладин\relax }}{12}{}\protected@file@percent }
\@writefile{lof}{\contentsline {figure}{\numberline {6}{\ignorespaces Ранние концепты фонов для анимационного фильма Алладин\relax }}{12}{}\protected@file@percent }
\@writefile{toc}{\contentsline {subsection}{\numberline {2.2}Возможности рисованной компьютерной анимации}{13}{}\protected@file@percent }
\@writefile{lof}{\contentsline {figure}{\numberline {7}{\ignorespaces Программы для цифровой графики и анимации: Adobe Photoshop и Toonz\relax }}{14}{}\protected@file@percent }
\@writefile{lof}{\contentsline {figure}{\numberline {8}{\ignorespaces Создание анимационного фильма Naruto\relax }}{14}{}\protected@file@percent }
\@writefile{lof}{\contentsline {figure}{\numberline {9}{\ignorespaces Концепт-арты при разработке персонажей анимационного фильма Человек-паук: Сквозь вселенные\relax }}{15}{}\protected@file@percent }
\@writefile{lof}{\contentsline {figure}{\numberline {11}{\ignorespaces Концепт-арты при разработке фонов анимационного фильма Человек-паук: Сквозь вселенные\relax }}{15}{}\protected@file@percent }
\@writefile{toc}{\contentsline {subsection}{\numberline {2.3}Плоские художественные стили}{16}{}\protected@file@percent }
\@writefile{lof}{\contentsline {figure}{\numberline {12}{\ignorespaces Работы Энди Уорхола. 1962 г\relax }}{16}{}\protected@file@percent }
\@writefile{lof}{\contentsline {figure}{\numberline {13}{\ignorespaces Рекламные плакаты А.М. Кассандра\relax }}{17}{}\protected@file@percent }
\@writefile{lof}{\contentsline {figure}{\numberline {14}{\ignorespaces Рекламные плакаты А.М. Кассандра\relax }}{18}{}\protected@file@percent }
\@writefile{lof}{\contentsline {figure}{\numberline {15}{\ignorespaces Работы Х. Пушвангера\relax }}{18}{}\protected@file@percent }
\@writefile{toc}{\contentsline {subsection}{\numberline {2.4}Плоские стили в современной иллюстрации}{19}{}\protected@file@percent }
\@writefile{lof}{\contentsline {figure}{\numberline {16}{\ignorespaces Цифровые иллюстрации Ryo Takemasa\relax }}{19}{}\protected@file@percent }
\@writefile{lof}{\contentsline {figure}{\numberline {17}{\ignorespaces Иллюстрация Thiago Steka\relax }}{20}{}\protected@file@percent }
\@writefile{lof}{\contentsline {figure}{\numberline {19}{\ignorespaces Иллюстрации на тему известных фильмов от Airplan Studio\relax }}{20}{}\protected@file@percent }
\@writefile{lof}{\contentsline {figure}{\numberline {20}{\ignorespaces Иллюстрации Giordano Poloni (слева) и Marina Vishtak (справа)\relax }}{21}{}\protected@file@percent }
\@writefile{lof}{\contentsline {figure}{\numberline {21}{\ignorespaces Иллюстрация Dinos \& Teacups\relax }}{22}{}\protected@file@percent }
\@writefile{lof}{\contentsline {figure}{\numberline {22}{\ignorespaces Иллюстрация youngeun kwon\relax }}{22}{}\protected@file@percent }
\@writefile{lof}{\contentsline {figure}{\numberline {23}{\ignorespaces Страницы из гайдбука Alegria\relax }}{23}{}\protected@file@percent }
\@writefile{lof}{\contentsline {figure}{\numberline {24}{\ignorespaces Основные принципы Alegria\relax }}{23}{}\protected@file@percent }
\@writefile{lof}{\contentsline {figure}{\numberline {25}{\ignorespaces Типичное изображение людей в Alegria\relax }}{24}{}\protected@file@percent }
\@writefile{lof}{\contentsline {figure}{\numberline {26}{\ignorespaces Примеры изображения человека в окружении\relax }}{24}{}\protected@file@percent }
\@writefile{toc}{\contentsline {subsection}{\numberline {2.5}Цветовые схемы в современной иллюстрации}{24}{}\protected@file@percent }
\@writefile{lof}{\contentsline {figure}{\numberline {27}{\ignorespaces Стиль Metro в Windows 8 и Human interace в MacOS Big Sur\relax }}{25}{}\protected@file@percent }
\@writefile{lof}{\contentsline {figure}{\numberline {28}{\ignorespaces Адаптивные цветовые схемы в Android 12\relax }}{25}{}\protected@file@percent }
\@writefile{lof}{\contentsline {figure}{\numberline {29}{\ignorespaces Цветовые палитры Material и принципы подбора сочетаемых цветов\relax }}{26}{}\protected@file@percent }
\@writefile{toc}{\contentsline {subsection}{\numberline {2.6}Плоские стили в современной анимации}{26}{}\protected@file@percent }
\@writefile{lof}{\contentsline {figure}{\numberline {30}{\ignorespaces Короткометражный анимационный фильм Cacoon\relax }}{26}{}\protected@file@percent }
\@writefile{lof}{\contentsline {figure}{\numberline {31}{\ignorespaces Короткометражный анимационный фильм Planet Under Pressure\relax }}{27}{}\protected@file@percent }
\@writefile{lof}{\contentsline {figure}{\numberline {32}{\ignorespaces Короткометражный анимационный фильм Etrez\relax }}{27}{}\protected@file@percent }
\@writefile{lof}{\contentsline {figure}{\numberline {33}{\ignorespaces Полнометражный анимационный фильм Birdboy: The forgotten children\relax }}{28}{}\protected@file@percent }
\@writefile{lof}{\contentsline {figure}{\numberline {34}{\ignorespaces Анимационный сериал от Headspace\relax }}{28}{}\protected@file@percent }
\@writefile{lof}{\contentsline {figure}{\numberline {35}{\ignorespaces Анимационный сериал от Headspace\relax }}{29}{}\protected@file@percent }
\@writefile{lof}{\contentsline {figure}{\numberline {37}{\ignorespaces Дизайн персонажей сериала Samurai Jack\relax }}{30}{}\protected@file@percent }
\@writefile{lof}{\contentsline {figure}{\numberline {39}{\ignorespaces Фоны из сериала Samurai Jack\relax }}{31}{}\protected@file@percent }
\@writefile{toc}{\contentsline {section}{\numberline {3}Художественная часть}{32}{}\protected@file@percent }
\@writefile{toc}{\contentsline {subsection}{\numberline {3.1}Процесс разработки сценария фильма}{32}{}\protected@file@percent }
\@writefile{toc}{\contentsline {subsection}{\numberline {3.2}Выбор названия}{33}{}\protected@file@percent }
\@writefile{lof}{\contentsline {figure}{\numberline {40}{\ignorespaces Обложка альбома «Wish You Were Here», 1975 г\relax }}{34}{}\protected@file@percent }
\@writefile{lof}{\contentsline {figure}{\numberline {41}{\ignorespaces Кадры из анимационных эпизодов Pink Floyd The Wall\relax }}{35}{}\protected@file@percent }
\@writefile{lof}{\contentsline {figure}{\numberline {42}{\ignorespaces Кадр из анимационных эпизодов Pink Floyd The Wall\relax }}{35}{}\protected@file@percent }
\@writefile{lof}{\contentsline {figure}{\numberline {43}{\ignorespaces Кадр из анимационных эпизодов Pink Floyd The Wall\relax }}{36}{}\protected@file@percent }
\@writefile{toc}{\contentsline {subsection}{\numberline {3.3}Разработка дизайна персонажей}{36}{}\protected@file@percent }
\@writefile{lof}{\contentsline {figure}{\numberline {44}{\ignorespaces Ранние карандашные наброски персонажа\relax }}{37}{}\protected@file@percent }
\@writefile{lof}{\contentsline {figure}{\numberline {45}{\ignorespaces Наброски с пропорциями персонажа\relax }}{38}{}\protected@file@percent }
\@writefile{lof}{\contentsline {figure}{\numberline {46}{\ignorespaces Силуэт персонажа\relax }}{39}{}\protected@file@percent }
\@writefile{lof}{\contentsline {figure}{\numberline {47}{\ignorespaces Пропорции и поиск цветовой палитры\relax }}{40}{}\protected@file@percent }
\@writefile{lof}{\contentsline {figure}{\numberline {49}{\ignorespaces Ранние наброски персонажа\relax }}{41}{}\protected@file@percent }
\@writefile{lof}{\contentsline {figure}{\numberline {50}{\ignorespaces Фотографии лабрадора (слева) и золотистого ретиривера (справа)\relax }}{42}{}\protected@file@percent }
\@writefile{lof}{\contentsline {figure}{\numberline {51}{\ignorespaces Поиск цветовой палитры персонажа и позы\relax }}{42}{}\protected@file@percent }
\@writefile{lof}{\contentsline {figure}{\numberline {52}{\ignorespaces Силуэты персонажа\relax }}{43}{}\protected@file@percent }
\@writefile{toc}{\contentsline {subsection}{\numberline {3.4}Разработка фоновых рисунков}{43}{}\protected@file@percent }
\@writefile{lof}{\contentsline {figure}{\numberline {54}{\ignorespaces Референсы для локации Лес\relax }}{44}{}\protected@file@percent }
\@writefile{lof}{\contentsline {figure}{\numberline {56}{\ignorespaces Референсы для локации Горы\relax }}{45}{}\protected@file@percent }
\@writefile{lof}{\contentsline {figure}{\numberline {57}{\ignorespaces Референсы для локации Горы\relax }}{45}{}\protected@file@percent }
\@writefile{lof}{\contentsline {figure}{\numberline {58}{\ignorespaces Процесс создания фона для локации Горы\relax }}{46}{}\protected@file@percent }
\@writefile{lof}{\contentsline {figure}{\numberline {59}{\ignorespaces Процесс создания фона для локации Подвесной мост\relax }}{46}{}\protected@file@percent }
\@writefile{lof}{\contentsline {figure}{\numberline {60}{\ignorespaces Сравнение режимов наложения: Normal (слева) и Soft Light (справа)\relax }}{47}{}\protected@file@percent }
\@writefile{lof}{\contentsline {figure}{\numberline {61}{\ignorespaces Пробное фоновое изображение леса\relax }}{47}{}\protected@file@percent }
\@writefile{lof}{\contentsline {figure}{\numberline {62}{\ignorespaces Пробное фоновое изображение леса\relax }}{48}{}\protected@file@percent }
\@writefile{toc}{\contentsline {section}{\numberline {4}Техническая часть}{49}{}\protected@file@percent }
\@writefile{lof}{\contentsline {figure}{\numberline {63}{\ignorespaces Виджет слоёв и точной настройки кистей\relax }}{50}{}\protected@file@percent }
\@writefile{lof}{\contentsline {figure}{\numberline {64}{\ignorespaces Пользовательский интерфейс редактора Krita в режиме анимации\relax }}{51}{}\protected@file@percent }
\@writefile{lof}{\contentsline {figure}{\numberline {65}{\ignorespaces Использование режима onion skin\relax }}{51}{}\protected@file@percent }
\@writefile{lof}{\contentsline {figure}{\numberline {66}{\ignorespaces Пользовательский интерфейс редактора Blender в режиме видео редактирования\relax }}{52}{}\protected@file@percent }
\@writefile{lof}{\contentsline {figure}{\numberline {67}{\ignorespaces Пользовательский интерфейс редактора Ardour\relax }}{53}{}\protected@file@percent }
\@writefile{toc}{\contentsline {section}{Заключение}{54}{}\protected@file@percent }
\@writefile{toc}{\contentsline {section}{Библиографический список}{55}{}\protected@file@percent }
\@writefile{toc}{\contentsline {section}{Приложение А. Киносценарий}{56}{}\protected@file@percent }
\@writefile{toc}{\contentsline {section}{Приложение Б. Листы персонажей}{59}{}\protected@file@percent }
\@writefile{lof}{\contentsline {figure}{\numberline {68}{\ignorespaces \relax }}{59}{}\protected@file@percent }
\@writefile{lof}{\contentsline {figure}{\numberline {69}{\ignorespaces \relax }}{60}{}\protected@file@percent }
\@writefile{toc}{\contentsline {section}{Приложение В. Фоны и компоновочные кадры}{61}{}\protected@file@percent }
\@writefile{lof}{\contentsline {figure}{\numberline {70}{\ignorespaces \relax }}{61}{}\protected@file@percent }
\@writefile{lof}{\contentsline {figure}{\numberline {71}{\ignorespaces \relax }}{61}{}\protected@file@percent }
\@writefile{lof}{\contentsline {figure}{\numberline {72}{\ignorespaces \relax }}{62}{}\protected@file@percent }
\@writefile{lof}{\contentsline {figure}{\numberline {73}{\ignorespaces \relax }}{62}{}\protected@file@percent }
\@writefile{lof}{\contentsline {figure}{\numberline {74}{\ignorespaces \relax }}{63}{}\protected@file@percent }
\@writefile{lof}{\contentsline {figure}{\numberline {75}{\ignorespaces \relax }}{63}{}\protected@file@percent }
\gdef \@abspage@last{63}
