/*
WARNING: Do NOT edit the input and output ports in this file in a text
editor if you plan to continue editing the block that represents it in
the Block Editor! File corruption is VERY likely to occur.
*/
/*
Copyright (C) 2020  Intel Corporation. All rights reserved.
Your use of Intel Corporation's design tools, logic functions 
and other software and tools, and any partner logic 
functions, and any output files from any of the foregoing 
(including device programming or simulation files), and any 
associated documentation or information are expressly subject 
to the terms and conditions of the Intel Program License 
Subscription Agreement, the Intel Quartus Prime License Agreement,
the Intel FPGA IP License Agreement, or other applicable license
agreement, including, without limitation, that your use is for
the sole purpose of programming logic devices manufactured by
Intel and sold by Intel or its authorized distributors.  Please
refer to the applicable agreement for further details, at
https://fpgasoftware.intel.com/eula.
*/
(header "graphic" (version "1.4"))
(pin
	(input)
	(rect 16 216 184 232)
	(text "INPUT" (rect 125 0 154 10)(font "Arial" (font_size 6)))
	(text "btn_reset" (rect 5 0 52 11)(font "Arial" ))
	(pt 168 8)
	(drawing
		(line (pt 84 12)(pt 109 12))
		(line (pt 84 4)(pt 109 4))
		(line (pt 113 8)(pt 168 8))
		(line (pt 84 12)(pt 84 4))
		(line (pt 109 4)(pt 113 8))
		(line (pt 109 12)(pt 113 8))
	)
	(text "VCC" (rect 128 7 149 17)(font "Arial" (font_size 6)))
)
(pin
	(input)
	(rect 16 176 184 192)
	(text "INPUT" (rect 125 0 154 10)(font "Arial" (font_size 6)))
	(text "clk50Mhz" (rect 5 0 54 11)(font "Arial" ))
	(pt 168 8)
	(drawing
		(line (pt 84 12)(pt 109 12))
		(line (pt 84 4)(pt 109 4))
		(line (pt 113 8)(pt 168 8))
		(line (pt 84 12)(pt 84 4))
		(line (pt 109 4)(pt 113 8))
		(line (pt 109 12)(pt 113 8))
	)
	(text "VCC" (rect 128 7 149 17)(font "Arial" (font_size 6)))
	(annotation_block (location)(rect -40 192 16 208))
)
(pin
	(output)
	(rect 848 264 1024 280)
	(text "OUTPUT" (rect 1 0 41 10)(font "Arial" (font_size 6)))
	(text "gpio" (rect 90 0 112 11)(font "Arial" ))
	(pt 0 8)
	(drawing
		(line (pt 0 8)(pt 52 8))
		(line (pt 52 4)(pt 78 4))
		(line (pt 52 12)(pt 78 12))
		(line (pt 52 12)(pt 52 4))
		(line (pt 78 4)(pt 82 8))
		(line (pt 82 8)(pt 78 12))
		(line (pt 78 12)(pt 82 8))
	)
)
(symbol
	(rect 184 112 344 256)
	(text "pll" (rect 74 -1 91 15)(font "Arial" (font_size 10)))
	(text "inst" (rect 8 128 26 139)(font "Arial" ))
	(port
		(pt 0 72)
		(input)
		(text "refclk" (rect 0 0 33 13)(font "Arial" (font_size 8)))
		(text "refclk" (rect 4 61 37 74)(font "Arial" (font_size 8)))
		(line (pt 0 72)(pt 48 72))
	)
	(port
		(pt 0 112)
		(input)
		(text "rst" (rect 0 0 15 13)(font "Arial" (font_size 8)))
		(text "rst" (rect 4 101 19 114)(font "Arial" (font_size 8)))
		(line (pt 0 112)(pt 48 112))
	)
	(port
		(pt 160 72)
		(output)
		(text "outclk_0" (rect 0 0 48 13)(font "Arial" (font_size 8)))
		(text "outclk_0" (rect 117 61 165 74)(font "Arial" (font_size 8)))
		(line (pt 160 72)(pt 112 72))
	)
	(drawing
		(text "refclk" (rect 16 43 51 57)(font "Arial" (color 128 0 0)(font_size 9)))
		(text "clk" (rect 53 67 68 78)(font "Arial" (color 0 0 0)))
		(text "reset" (rect 19 83 53 97)(font "Arial" (color 128 0 0)(font_size 9)))
		(text "reset" (rect 53 107 78 118)(font "Arial" (color 0 0 0)))
		(text "outclk0" (rect 113 43 159 57)(font "Arial" (color 128 0 0)(font_size 9)))
		(text "clk" (rect 97 67 112 78)(font "Arial" (color 0 0 0)))
		(text " altera_pll " (rect 118 128 168 139)(font "Arial" ))
		(line (pt 48 32)(pt 112 32))
		(line (pt 112 32)(pt 112 128))
		(line (pt 48 128)(pt 112 128))
		(line (pt 48 32)(pt 48 128))
		(line (pt 49 52)(pt 49 76))
		(line (pt 50 52)(pt 50 76))
		(line (pt 49 92)(pt 49 116))
		(line (pt 50 92)(pt 50 116))
		(line (pt 111 52)(pt 111 76))
		(line (pt 110 52)(pt 110 76))
		(line (pt 0 0)(pt 160 0))
		(line (pt 160 0)(pt 160 144))
		(line (pt 0 144)(pt 160 144))
		(line (pt 0 0)(pt 0 144))
	)
)
(symbol
	(rect 512 240 656 320)
	(text "clock_divider" (rect 5 0 71 11)(font "Arial" ))
	(text "inst1" (rect 8 64 32 77)(font "Intel Clear" ))
	(port
		(pt 0 32)
		(input)
		(text "i_clk" (rect 0 0 23 11)(font "Arial" ))
		(text "i_clk" (rect 21 27 44 38)(font "Arial" ))
		(line (pt 0 32)(pt 16 32))
	)
	(port
		(pt 144 32)
		(output)
		(text "o_clk" (rect 0 0 27 11)(font "Arial" ))
		(text "o_clk" (rect 101 27 128 38)(font "Arial" ))
		(line (pt 144 32)(pt 128 32))
	)
	(parameter
		"CASCADE_COUNT"
		"17"
		""
		(type "PARAMETER_SIGNED_DEC")	)
	(drawing
		(rectangle (rect 16 16 128 64))
	)
	(annotation_block (parameter)(rect 464 208 673 238))
)
(symbol
	(rect 768 248 832 296)
	(text "AND3" (rect 1 0 29 10)(font "Arial" (font_size 6)))
	(text "inst3" (rect 3 37 27 50)(font "Intel Clear" ))
	(port
		(pt 0 16)
		(input)
		(text "IN1" (rect 2 7 22 18)(font "Courier New" (bold))(invisible))
		(text "IN1" (rect 2 7 22 18)(font "Courier New" (bold))(invisible))
		(line (pt 0 16)(pt 16 16))
	)
	(port
		(pt 0 24)
		(input)
		(text "IN2" (rect 2 15 22 26)(font "Courier New" (bold))(invisible))
		(text "IN2" (rect 2 15 22 26)(font "Courier New" (bold))(invisible))
		(line (pt 0 24)(pt 16 24))
	)
	(port
		(pt 0 32)
		(input)
		(text "IN3" (rect 2 23 22 34)(font "Courier New" (bold))(invisible))
		(text "IN3" (rect 2 23 22 34)(font "Courier New" (bold))(invisible))
		(line (pt 0 32)(pt 16 32))
	)
	(port
		(pt 64 24)
		(output)
		(text "OUT" (rect 48 15 69 26)(font "Courier New" (bold))(invisible))
		(text "OUT" (rect 48 15 69 26)(font "Courier New" (bold))(invisible))
		(line (pt 43 24)(pt 64 24))
	)
	(drawing
		(line (pt 16 12)(pt 31 12))
		(line (pt 16 37)(pt 31 37))
		(line (pt 16 12)(pt 16 37))
		(arc (pt 31 36)(pt 31 12)(rect 19 12 44 37))
	)
)
(symbol
	(rect 512 368 656 448)
	(text "clock_divider" (rect 5 0 71 11)(font "Arial" ))
	(text "inst2" (rect 8 64 32 77)(font "Intel Clear" ))
	(port
		(pt 0 32)
		(input)
		(text "i_clk" (rect 0 0 23 11)(font "Arial" ))
		(text "i_clk" (rect 21 27 44 38)(font "Arial" ))
		(line (pt 0 32)(pt 16 32))
	)
	(port
		(pt 144 32)
		(output)
		(text "o_clk" (rect 0 0 27 11)(font "Arial" ))
		(text "o_clk" (rect 101 27 128 38)(font "Arial" ))
		(line (pt 144 32)(pt 128 32))
	)
	(parameter
		"CASCADE_COUNT"
		"9"
		""
		(type "PARAMETER_SIGNED_DEC")	)
	(drawing
		(rectangle (rect 16 16 128 64))
	)
	(annotation_block (parameter)(rect 464 336 673 366))
)
(connector
	(pt 448 184)
	(pt 448 272)
)
(connector
	(pt 448 272)
	(pt 512 272)
)
(connector
	(pt 672 272)
	(pt 672 328)
)
(connector
	(pt 672 328)
	(pt 456 328)
)
(connector
	(pt 456 328)
	(pt 456 400)
)
(connector
	(pt 456 400)
	(pt 512 400)
)
(connector
	(pt 768 280)
	(pt 736 280)
)
(connector
	(pt 736 400)
	(pt 736 280)
)
(connector
	(pt 656 272)
	(pt 672 272)
)
(connector
	(pt 736 184)
	(pt 736 264)
)
(connector
	(text "clk100Mhz" (rect 681 168 737 181)(font "Intel Clear" ))
	(pt 344 184)
	(pt 448 184)
)
(connector
	(pt 448 184)
	(pt 736 184)
)
(connector
	(pt 736 264)
	(pt 768 264)
)
(connector
	(text "clk763Hz" (rect 690 256 738 269)(font "Intel Clear" ))
	(pt 672 272)
	(pt 768 272)
)
(connector
	(pt 832 272)
	(pt 848 272)
)
(connector
	(text "clk1_49Hz" (rect 682 384 736 397)(font "Intel Clear" ))
	(pt 736 400)
	(pt 656 400)
)
(junction (pt 672 272))
(junction (pt 448 184))
