('C:\\xampp\\htdocs\\ai generated\\3d\\gpt4\\build\\main\\PYZ-00.pyz',
 [('__future__',
   'C:\\Users\\ReSoNaNCe-PC\\AppData\\Local\\Programs\\Python\\Python311\\Lib\\__future__.py',
   'PYMODULE'),
  ('_aix_support',
   'C:\\Users\\ReSoNaNCe-PC\\AppData\\Local\\Programs\\Python\\Python311\\Lib\\_aix_support.py',
   'PYMODULE'),
  ('_bootsubprocess',
   'C:\\Users\\ReSoNaNCe-PC\\AppData\\Local\\Programs\\Python\\Python311\\Lib\\_bootsubprocess.py',
   'PYMODULE'),
  ('_compat_pickle',
   'C:\\Users\\ReSoNaNCe-PC\\AppData\\Local\\Programs\\Python\\Python311\\Lib\\_compat_pickle.py',
   'PYMODULE'),
  ('_compression',
   'C:\\Users\\ReSoNaNCe-PC\\AppData\\Local\\Programs\\Python\\Python311\\Lib\\_compression.py',
   'PYMODULE'),
  ('_py_abc',
   'C:\\Users\\ReSoNaNCe-PC\\AppData\\Local\\Programs\\Python\\Python311\\Lib\\_py_abc.py',
   'PYMODULE'),
  ('_pydecimal',
   'C:\\Users\\ReSoNaNCe-PC\\AppData\\Local\\Programs\\Python\\Python311\\Lib\\_pydecimal.py',
   'PYMODULE'),
  ('_pyi_rth_utils',
   'C:\\Users\\ReSoNaNCe-PC\\AppData\\Local\\Programs\\Python\\Python311\\Lib\\site-packages\\PyInstaller\\fake-modules\\_pyi_rth_utils\\__init__.py',
   'PYMODULE'),
  ('_strptime',
   'C:\\Users\\ReSoNaNCe-PC\\AppData\\Local\\Programs\\Python\\Python311\\Lib\\_strptime.py',
   'PYMODULE'),
  ('_threading_local',
   'C:\\Users\\ReSoNaNCe-PC\\AppData\\Local\\Programs\\Python\\Python311\\Lib\\_threading_local.py',
   'PYMODULE'),
  ('argparse',
   'C:\\Users\\ReSoNaNCe-PC\\AppData\\Local\\Programs\\Python\\Python311\\Lib\\argparse.py',
   'PYMODULE'),
  ('ast',
   'C:\\Users\\ReSoNaNCe-PC\\AppData\\Local\\Programs\\Python\\Python311\\Lib\\ast.py',
   'PYMODULE'),
  ('asyncio',
   'C:\\Users\\ReSoNaNCe-PC\\AppData\\Local\\Programs\\Python\\Python311\\Lib\\asyncio\\__init__.py',
   'PYMODULE'),
  ('asyncio.base_events',
   'C:\\Users\\ReSoNaNCe-PC\\AppData\\Local\\Programs\\Python\\Python311\\Lib\\asyncio\\base_events.py',
   'PYMODULE'),
  ('asyncio.base_futures',
   'C:\\Users\\ReSoNaNCe-PC\\AppData\\Local\\Programs\\Python\\Python311\\Lib\\asyncio\\base_futures.py',
   'PYMODULE'),
  ('asyncio.base_subprocess',
   'C:\\Users\\ReSoNaNCe-PC\\AppData\\Local\\Programs\\Python\\Python311\\Lib\\asyncio\\base_subprocess.py',
   'PYMODULE'),
  ('asyncio.base_tasks',
   'C:\\Users\\ReSoNaNCe-PC\\AppData\\Local\\Programs\\Python\\Python311\\Lib\\asyncio\\base_tasks.py',
   'PYMODULE'),
  ('asyncio.constants',
   'C:\\Users\\ReSoNaNCe-PC\\AppData\\Local\\Programs\\Python\\Python311\\Lib\\asyncio\\constants.py',
   'PYMODULE'),
  ('asyncio.coroutines',
   'C:\\Users\\ReSoNaNCe-PC\\AppData\\Local\\Programs\\Python\\Python311\\Lib\\asyncio\\coroutines.py',
   'PYMODULE'),
  ('asyncio.events',
   'C:\\Users\\ReSoNaNCe-PC\\AppData\\Local\\Programs\\Python\\Python311\\Lib\\asyncio\\events.py',
   'PYMODULE'),
  ('asyncio.exceptions',
   'C:\\Users\\ReSoNaNCe-PC\\AppData\\Local\\Programs\\Python\\Python311\\Lib\\asyncio\\exceptions.py',
   'PYMODULE'),
  ('asyncio.format_helpers',
   'C:\\Users\\ReSoNaNCe-PC\\AppData\\Local\\Programs\\Python\\Python311\\Lib\\asyncio\\format_helpers.py',
   'PYMODULE'),
  ('asyncio.futures',
   'C:\\Users\\ReSoNaNCe-PC\\AppData\\Local\\Programs\\Python\\Python311\\Lib\\asyncio\\futures.py',
   'PYMODULE'),
  ('asyncio.locks',
   'C:\\Users\\ReSoNaNCe-PC\\AppData\\Local\\Programs\\Python\\Python311\\Lib\\asyncio\\locks.py',
   'PYMODULE'),
  ('asyncio.log',
   'C:\\Users\\ReSoNaNCe-PC\\AppData\\Local\\Programs\\Python\\Python311\\Lib\\asyncio\\log.py',
   'PYMODULE'),
  ('asyncio.mixins',
   'C:\\Users\\ReSoNaNCe-PC\\AppData\\Local\\Programs\\Python\\Python311\\Lib\\asyncio\\mixins.py',
   'PYMODULE'),
  ('asyncio.proactor_events',
   'C:\\Users\\ReSoNaNCe-PC\\AppData\\Local\\Programs\\Python\\Python311\\Lib\\asyncio\\proactor_events.py',
   'PYMODULE'),
  ('asyncio.protocols',
   'C:\\Users\\ReSoNaNCe-PC\\AppData\\Local\\Programs\\Python\\Python311\\Lib\\asyncio\\protocols.py',
   'PYMODULE'),
  ('asyncio.queues',
   'C:\\Users\\ReSoNaNCe-PC\\AppData\\Local\\Programs\\Python\\Python311\\Lib\\asyncio\\queues.py',
   'PYMODULE'),
  ('asyncio.runners',
   'C:\\Users\\ReSoNaNCe-PC\\AppData\\Local\\Programs\\Python\\Python311\\Lib\\asyncio\\runners.py',
   'PYMODULE'),
  ('asyncio.selector_events',
   'C:\\Users\\ReSoNaNCe-PC\\AppData\\Local\\Programs\\Python\\Python311\\Lib\\asyncio\\selector_events.py',
   'PYMODULE'),
  ('asyncio.sslproto',
   'C:\\Users\\ReSoNaNCe-PC\\AppData\\Local\\Programs\\Python\\Python311\\Lib\\asyncio\\sslproto.py',
   'PYMODULE'),
  ('asyncio.staggered',
   'C:\\Users\\ReSoNaNCe-PC\\AppData\\Local\\Programs\\Python\\Python311\\Lib\\asyncio\\staggered.py',
   'PYMODULE'),
  ('asyncio.streams',
   'C:\\Users\\ReSoNaNCe-PC\\AppData\\Local\\Programs\\Python\\Python311\\Lib\\asyncio\\streams.py',
   'PYMODULE'),
  ('asyncio.subprocess',
   'C:\\Users\\ReSoNaNCe-PC\\AppData\\Local\\Programs\\Python\\Python311\\Lib\\asyncio\\subprocess.py',
   'PYMODULE'),
  ('asyncio.taskgroups',
   'C:\\Users\\ReSoNaNCe-PC\\AppData\\Local\\Programs\\Python\\Python311\\Lib\\asyncio\\taskgroups.py',
   'PYMODULE'),
  ('asyncio.tasks',
   'C:\\Users\\ReSoNaNCe-PC\\AppData\\Local\\Programs\\Python\\Python311\\Lib\\asyncio\\tasks.py',
   'PYMODULE'),
  ('asyncio.threads',
   'C:\\Users\\ReSoNaNCe-PC\\AppData\\Local\\Programs\\Python\\Python311\\Lib\\asyncio\\threads.py',
   'PYMODULE'),
  ('asyncio.timeouts',
   'C:\\Users\\ReSoNaNCe-PC\\AppData\\Local\\Programs\\Python\\Python311\\Lib\\asyncio\\timeouts.py',
   'PYMODULE'),
  ('asyncio.transports',
   'C:\\Users\\ReSoNaNCe-PC\\AppData\\Local\\Programs\\Python\\Python311\\Lib\\asyncio\\transports.py',
   'PYMODULE'),
  ('asyncio.trsock',
   'C:\\Users\\ReSoNaNCe-PC\\AppData\\Local\\Programs\\Python\\Python311\\Lib\\asyncio\\trsock.py',
   'PYMODULE'),
  ('asyncio.unix_events',
   'C:\\Users\\ReSoNaNCe-PC\\AppData\\Local\\Programs\\Python\\Python311\\Lib\\asyncio\\unix_events.py',
   'PYMODULE'),
  ('asyncio.windows_events',
   'C:\\Users\\ReSoNaNCe-PC\\AppData\\Local\\Programs\\Python\\Python311\\Lib\\asyncio\\windows_events.py',
   'PYMODULE'),
  ('asyncio.windows_utils',
   'C:\\Users\\ReSoNaNCe-PC\\AppData\\Local\\Programs\\Python\\Python311\\Lib\\asyncio\\windows_utils.py',
   'PYMODULE'),
  ('base64',
   'C:\\Users\\ReSoNaNCe-PC\\AppData\\Local\\Programs\\Python\\Python311\\Lib\\base64.py',
   'PYMODULE'),
  ('bdb',
   'C:\\Users\\ReSoNaNCe-PC\\AppData\\Local\\Programs\\Python\\Python311\\Lib\\bdb.py',
   'PYMODULE'),
  ('bisect',
   'C:\\Users\\ReSoNaNCe-PC\\AppData\\Local\\Programs\\Python\\Python311\\Lib\\bisect.py',
   'PYMODULE'),
  ('bz2',
   'C:\\Users\\ReSoNaNCe-PC\\AppData\\Local\\Programs\\Python\\Python311\\Lib\\bz2.py',
   'PYMODULE'),
  ('calendar',
   'C:\\Users\\ReSoNaNCe-PC\\AppData\\Local\\Programs\\Python\\Python311\\Lib\\calendar.py',
   'PYMODULE'),
  ('cmd',
   'C:\\Users\\ReSoNaNCe-PC\\AppData\\Local\\Programs\\Python\\Python311\\Lib\\cmd.py',
   'PYMODULE'),
  ('code',
   'C:\\Users\\ReSoNaNCe-PC\\AppData\\Local\\Programs\\Python\\Python311\\Lib\\code.py',
   'PYMODULE'),
  ('codeop',
   'C:\\Users\\ReSoNaNCe-PC\\AppData\\Local\\Programs\\Python\\Python311\\Lib\\codeop.py',
   'PYMODULE'),
  ('concurrent',
   'C:\\Users\\ReSoNaNCe-PC\\AppData\\Local\\Programs\\Python\\Python311\\Lib\\concurrent\\__init__.py',
   'PYMODULE'),
  ('concurrent.futures',
   'C:\\Users\\ReSoNaNCe-PC\\AppData\\Local\\Programs\\Python\\Python311\\Lib\\concurrent\\futures\\__init__.py',
   'PYMODULE'),
  ('concurrent.futures._base',
   'C:\\Users\\ReSoNaNCe-PC\\AppData\\Local\\Programs\\Python\\Python311\\Lib\\concurrent\\futures\\_base.py',
   'PYMODULE'),
  ('concurrent.futures.process',
   'C:\\Users\\ReSoNaNCe-PC\\AppData\\Local\\Programs\\Python\\Python311\\Lib\\concurrent\\futures\\process.py',
   'PYMODULE'),
  ('concurrent.futures.thread',
   'C:\\Users\\ReSoNaNCe-PC\\AppData\\Local\\Programs\\Python\\Python311\\Lib\\concurrent\\futures\\thread.py',
   'PYMODULE'),
  ('contextlib',
   'C:\\Users\\ReSoNaNCe-PC\\AppData\\Local\\Programs\\Python\\Python311\\Lib\\contextlib.py',
   'PYMODULE'),
  ('contextvars',
   'C:\\Users\\ReSoNaNCe-PC\\AppData\\Local\\Programs\\Python\\Python311\\Lib\\contextvars.py',
   'PYMODULE'),
  ('copy',
   'C:\\Users\\ReSoNaNCe-PC\\AppData\\Local\\Programs\\Python\\Python311\\Lib\\copy.py',
   'PYMODULE'),
  ('csv',
   'C:\\Users\\ReSoNaNCe-PC\\AppData\\Local\\Programs\\Python\\Python311\\Lib\\csv.py',
   'PYMODULE'),
  ('ctypes',
   'C:\\Users\\ReSoNaNCe-PC\\AppData\\Local\\Programs\\Python\\Python311\\Lib\\ctypes\\__init__.py',
   'PYMODULE'),
  ('ctypes._endian',
   'C:\\Users\\ReSoNaNCe-PC\\AppData\\Local\\Programs\\Python\\Python311\\Lib\\ctypes\\_endian.py',
   'PYMODULE'),
  ('dataclasses',
   'C:\\Users\\ReSoNaNCe-PC\\AppData\\Local\\Programs\\Python\\Python311\\Lib\\dataclasses.py',
   'PYMODULE'),
  ('datetime',
   'C:\\Users\\ReSoNaNCe-PC\\AppData\\Local\\Programs\\Python\\Python311\\Lib\\datetime.py',
   'PYMODULE'),
  ('decimal',
   'C:\\Users\\ReSoNaNCe-PC\\AppData\\Local\\Programs\\Python\\Python311\\Lib\\decimal.py',
   'PYMODULE'),
  ('dis',
   'C:\\Users\\ReSoNaNCe-PC\\AppData\\Local\\Programs\\Python\\Python311\\Lib\\dis.py',
   'PYMODULE'),
  ('email',
   'C:\\Users\\ReSoNaNCe-PC\\AppData\\Local\\Programs\\Python\\Python311\\Lib\\email\\__init__.py',
   'PYMODULE'),
  ('email._encoded_words',
   'C:\\Users\\ReSoNaNCe-PC\\AppData\\Local\\Programs\\Python\\Python311\\Lib\\email\\_encoded_words.py',
   'PYMODULE'),
  ('email._header_value_parser',
   'C:\\Users\\ReSoNaNCe-PC\\AppData\\Local\\Programs\\Python\\Python311\\Lib\\email\\_header_value_parser.py',
   'PYMODULE'),
  ('email._parseaddr',
   'C:\\Users\\ReSoNaNCe-PC\\AppData\\Local\\Programs\\Python\\Python311\\Lib\\email\\_parseaddr.py',
   'PYMODULE'),
  ('email._policybase',
   'C:\\Users\\ReSoNaNCe-PC\\AppData\\Local\\Programs\\Python\\Python311\\Lib\\email\\_policybase.py',
   'PYMODULE'),
  ('email.base64mime',
   'C:\\Users\\ReSoNaNCe-PC\\AppData\\Local\\Programs\\Python\\Python311\\Lib\\email\\base64mime.py',
   'PYMODULE'),
  ('email.charset',
   'C:\\Users\\ReSoNaNCe-PC\\AppData\\Local\\Programs\\Python\\Python311\\Lib\\email\\charset.py',
   'PYMODULE'),
  ('email.contentmanager',
   'C:\\Users\\ReSoNaNCe-PC\\AppData\\Local\\Programs\\Python\\Python311\\Lib\\email\\contentmanager.py',
   'PYMODULE'),
  ('email.encoders',
   'C:\\Users\\ReSoNaNCe-PC\\AppData\\Local\\Programs\\Python\\Python311\\Lib\\email\\encoders.py',
   'PYMODULE'),
  ('email.errors',
   'C:\\Users\\ReSoNaNCe-PC\\AppData\\Local\\Programs\\Python\\Python311\\Lib\\email\\errors.py',
   'PYMODULE'),
  ('email.feedparser',
   'C:\\Users\\ReSoNaNCe-PC\\AppData\\Local\\Programs\\Python\\Python311\\Lib\\email\\feedparser.py',
   'PYMODULE'),
  ('email.generator',
   'C:\\Users\\ReSoNaNCe-PC\\AppData\\Local\\Programs\\Python\\Python311\\Lib\\email\\generator.py',
   'PYMODULE'),
  ('email.header',
   'C:\\Users\\ReSoNaNCe-PC\\AppData\\Local\\Programs\\Python\\Python311\\Lib\\email\\header.py',
   'PYMODULE'),
  ('email.headerregistry',
   'C:\\Users\\ReSoNaNCe-PC\\AppData\\Local\\Programs\\Python\\Python311\\Lib\\email\\headerregistry.py',
   'PYMODULE'),
  ('email.iterators',
   'C:\\Users\\ReSoNaNCe-PC\\AppData\\Local\\Programs\\Python\\Python311\\Lib\\email\\iterators.py',
   'PYMODULE'),
  ('email.message',
   'C:\\Users\\ReSoNaNCe-PC\\AppData\\Local\\Programs\\Python\\Python311\\Lib\\email\\message.py',
   'PYMODULE'),
  ('email.parser',
   'C:\\Users\\ReSoNaNCe-PC\\AppData\\Local\\Programs\\Python\\Python311\\Lib\\email\\parser.py',
   'PYMODULE'),
  ('email.policy',
   'C:\\Users\\ReSoNaNCe-PC\\AppData\\Local\\Programs\\Python\\Python311\\Lib\\email\\policy.py',
   'PYMODULE'),
  ('email.quoprimime',
   'C:\\Users\\ReSoNaNCe-PC\\AppData\\Local\\Programs\\Python\\Python311\\Lib\\email\\quoprimime.py',
   'PYMODULE'),
  ('email.utils',
   'C:\\Users\\ReSoNaNCe-PC\\AppData\\Local\\Programs\\Python\\Python311\\Lib\\email\\utils.py',
   'PYMODULE'),
  ('enemy', 'C:\\xampp\\htdocs\\ai generated\\3d\\gpt4\\enemy.py', 'PYMODULE'),
  ('fnmatch',
   'C:\\Users\\ReSoNaNCe-PC\\AppData\\Local\\Programs\\Python\\Python311\\Lib\\fnmatch.py',
   'PYMODULE'),
  ('fractions',
   'C:\\Users\\ReSoNaNCe-PC\\AppData\\Local\\Programs\\Python\\Python311\\Lib\\fractions.py',
   'PYMODULE'),
  ('ftplib',
   'C:\\Users\\ReSoNaNCe-PC\\AppData\\Local\\Programs\\Python\\Python311\\Lib\\ftplib.py',
   'PYMODULE'),
  ('getopt',
   'C:\\Users\\ReSoNaNCe-PC\\AppData\\Local\\Programs\\Python\\Python311\\Lib\\getopt.py',
   'PYMODULE'),
  ('getpass',
   'C:\\Users\\ReSoNaNCe-PC\\AppData\\Local\\Programs\\Python\\Python311\\Lib\\getpass.py',
   'PYMODULE'),
  ('gettext',
   'C:\\Users\\ReSoNaNCe-PC\\AppData\\Local\\Programs\\Python\\Python311\\Lib\\gettext.py',
   'PYMODULE'),
  ('glob',
   'C:\\Users\\ReSoNaNCe-PC\\AppData\\Local\\Programs\\Python\\Python311\\Lib\\glob.py',
   'PYMODULE'),
  ('graphics',
   'C:\\xampp\\htdocs\\ai generated\\3d\\gpt4\\graphics.py',
   'PYMODULE'),
  ('gzip',
   'C:\\Users\\ReSoNaNCe-PC\\AppData\\Local\\Programs\\Python\\Python311\\Lib\\gzip.py',
   'PYMODULE'),
  ('hashlib',
   'C:\\Users\\ReSoNaNCe-PC\\AppData\\Local\\Programs\\Python\\Python311\\Lib\\hashlib.py',
   'PYMODULE'),
  ('hmac',
   'C:\\Users\\ReSoNaNCe-PC\\AppData\\Local\\Programs\\Python\\Python311\\Lib\\hmac.py',
   'PYMODULE'),
  ('html',
   'C:\\Users\\ReSoNaNCe-PC\\AppData\\Local\\Programs\\Python\\Python311\\Lib\\html\\__init__.py',
   'PYMODULE'),
  ('html.entities',
   'C:\\Users\\ReSoNaNCe-PC\\AppData\\Local\\Programs\\Python\\Python311\\Lib\\html\\entities.py',
   'PYMODULE'),
  ('http',
   'C:\\Users\\ReSoNaNCe-PC\\AppData\\Local\\Programs\\Python\\Python311\\Lib\\http\\__init__.py',
   'PYMODULE'),
  ('http.client',
   'C:\\Users\\ReSoNaNCe-PC\\AppData\\Local\\Programs\\Python\\Python311\\Lib\\http\\client.py',
   'PYMODULE'),
  ('http.cookiejar',
   'C:\\Users\\ReSoNaNCe-PC\\AppData\\Local\\Programs\\Python\\Python311\\Lib\\http\\cookiejar.py',
   'PYMODULE'),
  ('http.server',
   'C:\\Users\\ReSoNaNCe-PC\\AppData\\Local\\Programs\\Python\\Python311\\Lib\\http\\server.py',
   'PYMODULE'),
  ('imp',
   'C:\\Users\\ReSoNaNCe-PC\\AppData\\Local\\Programs\\Python\\Python311\\Lib\\imp.py',
   'PYMODULE'),
  ('importlib',
   'C:\\Users\\ReSoNaNCe-PC\\AppData\\Local\\Programs\\Python\\Python311\\Lib\\importlib\\__init__.py',
   'PYMODULE'),
  ('importlib._abc',
   'C:\\Users\\ReSoNaNCe-PC\\AppData\\Local\\Programs\\Python\\Python311\\Lib\\importlib\\_abc.py',
   'PYMODULE'),
  ('importlib._bootstrap',
   'C:\\Users\\ReSoNaNCe-PC\\AppData\\Local\\Programs\\Python\\Python311\\Lib\\importlib\\_bootstrap.py',
   'PYMODULE'),
  ('importlib._bootstrap_external',
   'C:\\Users\\ReSoNaNCe-PC\\AppData\\Local\\Programs\\Python\\Python311\\Lib\\importlib\\_bootstrap_external.py',
   'PYMODULE'),
  ('importlib.abc',
   'C:\\Users\\ReSoNaNCe-PC\\AppData\\Local\\Programs\\Python\\Python311\\Lib\\importlib\\abc.py',
   'PYMODULE'),
  ('importlib.machinery',
   'C:\\Users\\ReSoNaNCe-PC\\AppData\\Local\\Programs\\Python\\Python311\\Lib\\importlib\\machinery.py',
   'PYMODULE'),
  ('importlib.metadata',
   'C:\\Users\\ReSoNaNCe-PC\\AppData\\Local\\Programs\\Python\\Python311\\Lib\\importlib\\metadata\\__init__.py',
   'PYMODULE'),
  ('importlib.metadata._adapters',
   'C:\\Users\\ReSoNaNCe-PC\\AppData\\Local\\Programs\\Python\\Python311\\Lib\\importlib\\metadata\\_adapters.py',
   'PYMODULE'),
  ('importlib.metadata._collections',
   'C:\\Users\\ReSoNaNCe-PC\\AppData\\Local\\Programs\\Python\\Python311\\Lib\\importlib\\metadata\\_collections.py',
   'PYMODULE'),
  ('importlib.metadata._functools',
   'C:\\Users\\ReSoNaNCe-PC\\AppData\\Local\\Programs\\Python\\Python311\\Lib\\importlib\\metadata\\_functools.py',
   'PYMODULE'),
  ('importlib.metadata._itertools',
   'C:\\Users\\ReSoNaNCe-PC\\AppData\\Local\\Programs\\Python\\Python311\\Lib\\importlib\\metadata\\_itertools.py',
   'PYMODULE'),
  ('importlib.metadata._meta',
   'C:\\Users\\ReSoNaNCe-PC\\AppData\\Local\\Programs\\Python\\Python311\\Lib\\importlib\\metadata\\_meta.py',
   'PYMODULE'),
  ('importlib.metadata._text',
   'C:\\Users\\ReSoNaNCe-PC\\AppData\\Local\\Programs\\Python\\Python311\\Lib\\importlib\\metadata\\_text.py',
   'PYMODULE'),
  ('importlib.readers',
   'C:\\Users\\ReSoNaNCe-PC\\AppData\\Local\\Programs\\Python\\Python311\\Lib\\importlib\\readers.py',
   'PYMODULE'),
  ('importlib.resources',
   'C:\\Users\\ReSoNaNCe-PC\\AppData\\Local\\Programs\\Python\\Python311\\Lib\\importlib\\resources\\__init__.py',
   'PYMODULE'),
  ('importlib.resources._adapters',
   'C:\\Users\\ReSoNaNCe-PC\\AppData\\Local\\Programs\\Python\\Python311\\Lib\\importlib\\resources\\_adapters.py',
   'PYMODULE'),
  ('importlib.resources._common',
   'C:\\Users\\ReSoNaNCe-PC\\AppData\\Local\\Programs\\Python\\Python311\\Lib\\importlib\\resources\\_common.py',
   'PYMODULE'),
  ('importlib.resources._itertools',
   'C:\\Users\\ReSoNaNCe-PC\\AppData\\Local\\Programs\\Python\\Python311\\Lib\\importlib\\resources\\_itertools.py',
   'PYMODULE'),
  ('importlib.resources._legacy',
   'C:\\Users\\ReSoNaNCe-PC\\AppData\\Local\\Programs\\Python\\Python311\\Lib\\importlib\\resources\\_legacy.py',
   'PYMODULE'),
  ('importlib.resources.abc',
   'C:\\Users\\ReSoNaNCe-PC\\AppData\\Local\\Programs\\Python\\Python311\\Lib\\importlib\\resources\\abc.py',
   'PYMODULE'),
  ('importlib.resources.readers',
   'C:\\Users\\ReSoNaNCe-PC\\AppData\\Local\\Programs\\Python\\Python311\\Lib\\importlib\\resources\\readers.py',
   'PYMODULE'),
  ('importlib.util',
   'C:\\Users\\ReSoNaNCe-PC\\AppData\\Local\\Programs\\Python\\Python311\\Lib\\importlib\\util.py',
   'PYMODULE'),
  ('inspect',
   'C:\\Users\\ReSoNaNCe-PC\\AppData\\Local\\Programs\\Python\\Python311\\Lib\\inspect.py',
   'PYMODULE'),
  ('ipaddress',
   'C:\\Users\\ReSoNaNCe-PC\\AppData\\Local\\Programs\\Python\\Python311\\Lib\\ipaddress.py',
   'PYMODULE'),
  ('item', 'C:\\xampp\\htdocs\\ai generated\\3d\\gpt4\\item.py', 'PYMODULE'),
  ('jinja2',
   'C:\\Users\\ReSoNaNCe-PC\\AppData\\Local\\Programs\\Python\\Python311\\Lib\\site-packages\\jinja2\\__init__.py',
   'PYMODULE'),
  ('jinja2._identifier',
   'C:\\Users\\ReSoNaNCe-PC\\AppData\\Local\\Programs\\Python\\Python311\\Lib\\site-packages\\jinja2\\_identifier.py',
   'PYMODULE'),
  ('jinja2.async_utils',
   'C:\\Users\\ReSoNaNCe-PC\\AppData\\Local\\Programs\\Python\\Python311\\Lib\\site-packages\\jinja2\\async_utils.py',
   'PYMODULE'),
  ('jinja2.bccache',
   'C:\\Users\\ReSoNaNCe-PC\\AppData\\Local\\Programs\\Python\\Python311\\Lib\\site-packages\\jinja2\\bccache.py',
   'PYMODULE'),
  ('jinja2.compiler',
   'C:\\Users\\ReSoNaNCe-PC\\AppData\\Local\\Programs\\Python\\Python311\\Lib\\site-packages\\jinja2\\compiler.py',
   'PYMODULE'),
  ('jinja2.constants',
   'C:\\Users\\ReSoNaNCe-PC\\AppData\\Local\\Programs\\Python\\Python311\\Lib\\site-packages\\jinja2\\constants.py',
   'PYMODULE'),
  ('jinja2.debug',
   'C:\\Users\\ReSoNaNCe-PC\\AppData\\Local\\Programs\\Python\\Python311\\Lib\\site-packages\\jinja2\\debug.py',
   'PYMODULE'),
  ('jinja2.defaults',
   'C:\\Users\\ReSoNaNCe-PC\\AppData\\Local\\Programs\\Python\\Python311\\Lib\\site-packages\\jinja2\\defaults.py',
   'PYMODULE'),
  ('jinja2.environment',
   'C:\\Users\\ReSoNaNCe-PC\\AppData\\Local\\Programs\\Python\\Python311\\Lib\\site-packages\\jinja2\\environment.py',
   'PYMODULE'),
  ('jinja2.exceptions',
   'C:\\Users\\ReSoNaNCe-PC\\AppData\\Local\\Programs\\Python\\Python311\\Lib\\site-packages\\jinja2\\exceptions.py',
   'PYMODULE'),
  ('jinja2.ext',
   'C:\\Users\\ReSoNaNCe-PC\\AppData\\Local\\Programs\\Python\\Python311\\Lib\\site-packages\\jinja2\\ext.py',
   'PYMODULE'),
  ('jinja2.filters',
   'C:\\Users\\ReSoNaNCe-PC\\AppData\\Local\\Programs\\Python\\Python311\\Lib\\site-packages\\jinja2\\filters.py',
   'PYMODULE'),
  ('jinja2.idtracking',
   'C:\\Users\\ReSoNaNCe-PC\\AppData\\Local\\Programs\\Python\\Python311\\Lib\\site-packages\\jinja2\\idtracking.py',
   'PYMODULE'),
  ('jinja2.lexer',
   'C:\\Users\\ReSoNaNCe-PC\\AppData\\Local\\Programs\\Python\\Python311\\Lib\\site-packages\\jinja2\\lexer.py',
   'PYMODULE'),
  ('jinja2.loaders',
   'C:\\Users\\ReSoNaNCe-PC\\AppData\\Local\\Programs\\Python\\Python311\\Lib\\site-packages\\jinja2\\loaders.py',
   'PYMODULE'),
  ('jinja2.nodes',
   'C:\\Users\\ReSoNaNCe-PC\\AppData\\Local\\Programs\\Python\\Python311\\Lib\\site-packages\\jinja2\\nodes.py',
   'PYMODULE'),
  ('jinja2.optimizer',
   'C:\\Users\\ReSoNaNCe-PC\\AppData\\Local\\Programs\\Python\\Python311\\Lib\\site-packages\\jinja2\\optimizer.py',
   'PYMODULE'),
  ('jinja2.parser',
   'C:\\Users\\ReSoNaNCe-PC\\AppData\\Local\\Programs\\Python\\Python311\\Lib\\site-packages\\jinja2\\parser.py',
   'PYMODULE'),
  ('jinja2.runtime',
   'C:\\Users\\ReSoNaNCe-PC\\AppData\\Local\\Programs\\Python\\Python311\\Lib\\site-packages\\jinja2\\runtime.py',
   'PYMODULE'),
  ('jinja2.sandbox',
   'C:\\Users\\ReSoNaNCe-PC\\AppData\\Local\\Programs\\Python\\Python311\\Lib\\site-packages\\jinja2\\sandbox.py',
   'PYMODULE'),
  ('jinja2.tests',
   'C:\\Users\\ReSoNaNCe-PC\\AppData\\Local\\Programs\\Python\\Python311\\Lib\\site-packages\\jinja2\\tests.py',
   'PYMODULE'),
  ('jinja2.utils',
   'C:\\Users\\ReSoNaNCe-PC\\AppData\\Local\\Programs\\Python\\Python311\\Lib\\site-packages\\jinja2\\utils.py',
   'PYMODULE'),
  ('jinja2.visitor',
   'C:\\Users\\ReSoNaNCe-PC\\AppData\\Local\\Programs\\Python\\Python311\\Lib\\site-packages\\jinja2\\visitor.py',
   'PYMODULE'),
  ('json',
   'C:\\Users\\ReSoNaNCe-PC\\AppData\\Local\\Programs\\Python\\Python311\\Lib\\json\\__init__.py',
   'PYMODULE'),
  ('json.decoder',
   'C:\\Users\\ReSoNaNCe-PC\\AppData\\Local\\Programs\\Python\\Python311\\Lib\\json\\decoder.py',
   'PYMODULE'),
  ('json.encoder',
   'C:\\Users\\ReSoNaNCe-PC\\AppData\\Local\\Programs\\Python\\Python311\\Lib\\json\\encoder.py',
   'PYMODULE'),
  ('json.scanner',
   'C:\\Users\\ReSoNaNCe-PC\\AppData\\Local\\Programs\\Python\\Python311\\Lib\\json\\scanner.py',
   'PYMODULE'),
  ('level', 'C:\\xampp\\htdocs\\ai generated\\3d\\gpt4\\level.py', 'PYMODULE'),
  ('logging',
   'C:\\Users\\ReSoNaNCe-PC\\AppData\\Local\\Programs\\Python\\Python311\\Lib\\logging\\__init__.py',
   'PYMODULE'),
  ('lzma',
   'C:\\Users\\ReSoNaNCe-PC\\AppData\\Local\\Programs\\Python\\Python311\\Lib\\lzma.py',
   'PYMODULE'),
  ('markupsafe',
   'C:\\Users\\ReSoNaNCe-PC\\AppData\\Local\\Programs\\Python\\Python311\\Lib\\site-packages\\markupsafe\\__init__.py',
   'PYMODULE'),
  ('markupsafe._native',
   'C:\\Users\\ReSoNaNCe-PC\\AppData\\Local\\Programs\\Python\\Python311\\Lib\\site-packages\\markupsafe\\_native.py',
   'PYMODULE'),
  ('mimetypes',
   'C:\\Users\\ReSoNaNCe-PC\\AppData\\Local\\Programs\\Python\\Python311\\Lib\\mimetypes.py',
   'PYMODULE'),
  ('minimap',
   'C:\\xampp\\htdocs\\ai generated\\3d\\gpt4\\minimap.py',
   'PYMODULE'),
  ('multiprocessing',
   'C:\\Users\\ReSoNaNCe-PC\\AppData\\Local\\Programs\\Python\\Python311\\Lib\\multiprocessing\\__init__.py',
   'PYMODULE'),
  ('multiprocessing.connection',
   'C:\\Users\\ReSoNaNCe-PC\\AppData\\Local\\Programs\\Python\\Python311\\Lib\\multiprocessing\\connection.py',
   'PYMODULE'),
  ('multiprocessing.context',
   'C:\\Users\\ReSoNaNCe-PC\\AppData\\Local\\Programs\\Python\\Python311\\Lib\\multiprocessing\\context.py',
   'PYMODULE'),
  ('multiprocessing.dummy',
   'C:\\Users\\ReSoNaNCe-PC\\AppData\\Local\\Programs\\Python\\Python311\\Lib\\multiprocessing\\dummy\\__init__.py',
   'PYMODULE'),
  ('multiprocessing.dummy.connection',
   'C:\\Users\\ReSoNaNCe-PC\\AppData\\Local\\Programs\\Python\\Python311\\Lib\\multiprocessing\\dummy\\connection.py',
   'PYMODULE'),
  ('multiprocessing.forkserver',
   'C:\\Users\\ReSoNaNCe-PC\\AppData\\Local\\Programs\\Python\\Python311\\Lib\\multiprocessing\\forkserver.py',
   'PYMODULE'),
  ('multiprocessing.heap',
   'C:\\Users\\ReSoNaNCe-PC\\AppData\\Local\\Programs\\Python\\Python311\\Lib\\multiprocessing\\heap.py',
   'PYMODULE'),
  ('multiprocessing.managers',
   'C:\\Users\\ReSoNaNCe-PC\\AppData\\Local\\Programs\\Python\\Python311\\Lib\\multiprocessing\\managers.py',
   'PYMODULE'),
  ('multiprocessing.pool',
   'C:\\Users\\ReSoNaNCe-PC\\AppData\\Local\\Programs\\Python\\Python311\\Lib\\multiprocessing\\pool.py',
   'PYMODULE'),
  ('multiprocessing.popen_fork',
   'C:\\Users\\ReSoNaNCe-PC\\AppData\\Local\\Programs\\Python\\Python311\\Lib\\multiprocessing\\popen_fork.py',
   'PYMODULE'),
  ('multiprocessing.popen_forkserver',
   'C:\\Users\\ReSoNaNCe-PC\\AppData\\Local\\Programs\\Python\\Python311\\Lib\\multiprocessing\\popen_forkserver.py',
   'PYMODULE'),
  ('multiprocessing.popen_spawn_posix',
   'C:\\Users\\ReSoNaNCe-PC\\AppData\\Local\\Programs\\Python\\Python311\\Lib\\multiprocessing\\popen_spawn_posix.py',
   'PYMODULE'),
  ('multiprocessing.popen_spawn_win32',
   'C:\\Users\\ReSoNaNCe-PC\\AppData\\Local\\Programs\\Python\\Python311\\Lib\\multiprocessing\\popen_spawn_win32.py',
   'PYMODULE'),
  ('multiprocessing.process',
   'C:\\Users\\ReSoNaNCe-PC\\AppData\\Local\\Programs\\Python\\Python311\\Lib\\multiprocessing\\process.py',
   'PYMODULE'),
  ('multiprocessing.queues',
   'C:\\Users\\ReSoNaNCe-PC\\AppData\\Local\\Programs\\Python\\Python311\\Lib\\multiprocessing\\queues.py',
   'PYMODULE'),
  ('multiprocessing.reduction',
   'C:\\Users\\ReSoNaNCe-PC\\AppData\\Local\\Programs\\Python\\Python311\\Lib\\multiprocessing\\reduction.py',
   'PYMODULE'),
  ('multiprocessing.resource_sharer',
   'C:\\Users\\ReSoNaNCe-PC\\AppData\\Local\\Programs\\Python\\Python311\\Lib\\multiprocessing\\resource_sharer.py',
   'PYMODULE'),
  ('multiprocessing.resource_tracker',
   'C:\\Users\\ReSoNaNCe-PC\\AppData\\Local\\Programs\\Python\\Python311\\Lib\\multiprocessing\\resource_tracker.py',
   'PYMODULE'),
  ('multiprocessing.shared_memory',
   'C:\\Users\\ReSoNaNCe-PC\\AppData\\Local\\Programs\\Python\\Python311\\Lib\\multiprocessing\\shared_memory.py',
   'PYMODULE'),
  ('multiprocessing.sharedctypes',
   'C:\\Users\\ReSoNaNCe-PC\\AppData\\Local\\Programs\\Python\\Python311\\Lib\\multiprocessing\\sharedctypes.py',
   'PYMODULE'),
  ('multiprocessing.spawn',
   'C:\\Users\\ReSoNaNCe-PC\\AppData\\Local\\Programs\\Python\\Python311\\Lib\\multiprocessing\\spawn.py',
   'PYMODULE'),
  ('multiprocessing.synchronize',
   'C:\\Users\\ReSoNaNCe-PC\\AppData\\Local\\Programs\\Python\\Python311\\Lib\\multiprocessing\\synchronize.py',
   'PYMODULE'),
  ('multiprocessing.util',
   'C:\\Users\\ReSoNaNCe-PC\\AppData\\Local\\Programs\\Python\\Python311\\Lib\\multiprocessing\\util.py',
   'PYMODULE'),
  ('netrc',
   'C:\\Users\\ReSoNaNCe-PC\\AppData\\Local\\Programs\\Python\\Python311\\Lib\\netrc.py',
   'PYMODULE'),
  ('nturl2path',
   'C:\\Users\\ReSoNaNCe-PC\\AppData\\Local\\Programs\\Python\\Python311\\Lib\\nturl2path.py',
   'PYMODULE'),
  ('numbers',
   'C:\\Users\\ReSoNaNCe-PC\\AppData\\Local\\Programs\\Python\\Python311\\Lib\\numbers.py',
   'PYMODULE'),
  ('opcode',
   'C:\\Users\\ReSoNaNCe-PC\\AppData\\Local\\Programs\\Python\\Python311\\Lib\\opcode.py',
   'PYMODULE'),
  ('packaging',
   'C:\\Users\\ReSoNaNCe-PC\\AppData\\Local\\Programs\\Python\\Python311\\Lib\\site-packages\\packaging\\__init__.py',
   'PYMODULE'),
  ('packaging._elffile',
   'C:\\Users\\ReSoNaNCe-PC\\AppData\\Local\\Programs\\Python\\Python311\\Lib\\site-packages\\packaging\\_elffile.py',
   'PYMODULE'),
  ('packaging._manylinux',
   'C:\\Users\\ReSoNaNCe-PC\\AppData\\Local\\Programs\\Python\\Python311\\Lib\\site-packages\\packaging\\_manylinux.py',
   'PYMODULE'),
  ('packaging._musllinux',
   'C:\\Users\\ReSoNaNCe-PC\\AppData\\Local\\Programs\\Python\\Python311\\Lib\\site-packages\\packaging\\_musllinux.py',
   'PYMODULE'),
  ('packaging._parser',
   'C:\\Users\\ReSoNaNCe-PC\\AppData\\Local\\Programs\\Python\\Python311\\Lib\\site-packages\\packaging\\_parser.py',
   'PYMODULE'),
  ('packaging._structures',
   'C:\\Users\\ReSoNaNCe-PC\\AppData\\Local\\Programs\\Python\\Python311\\Lib\\site-packages\\packaging\\_structures.py',
   'PYMODULE'),
  ('packaging._tokenizer',
   'C:\\Users\\ReSoNaNCe-PC\\AppData\\Local\\Programs\\Python\\Python311\\Lib\\site-packages\\packaging\\_tokenizer.py',
   'PYMODULE'),
  ('packaging.markers',
   'C:\\Users\\ReSoNaNCe-PC\\AppData\\Local\\Programs\\Python\\Python311\\Lib\\site-packages\\packaging\\markers.py',
   'PYMODULE'),
  ('packaging.metadata',
   'C:\\Users\\ReSoNaNCe-PC\\AppData\\Local\\Programs\\Python\\Python311\\Lib\\site-packages\\packaging\\metadata.py',
   'PYMODULE'),
  ('packaging.requirements',
   'C:\\Users\\ReSoNaNCe-PC\\AppData\\Local\\Programs\\Python\\Python311\\Lib\\site-packages\\packaging\\requirements.py',
   'PYMODULE'),
  ('packaging.specifiers',
   'C:\\Users\\ReSoNaNCe-PC\\AppData\\Local\\Programs\\Python\\Python311\\Lib\\site-packages\\packaging\\specifiers.py',
   'PYMODULE'),
  ('packaging.tags',
   'C:\\Users\\ReSoNaNCe-PC\\AppData\\Local\\Programs\\Python\\Python311\\Lib\\site-packages\\packaging\\tags.py',
   'PYMODULE'),
  ('packaging.utils',
   'C:\\Users\\ReSoNaNCe-PC\\AppData\\Local\\Programs\\Python\\Python311\\Lib\\site-packages\\packaging\\utils.py',
   'PYMODULE'),
  ('packaging.version',
   'C:\\Users\\ReSoNaNCe-PC\\AppData\\Local\\Programs\\Python\\Python311\\Lib\\site-packages\\packaging\\version.py',
   'PYMODULE'),
  ('pathlib',
   'C:\\Users\\ReSoNaNCe-PC\\AppData\\Local\\Programs\\Python\\Python311\\Lib\\pathlib.py',
   'PYMODULE'),
  ('pdb',
   'C:\\Users\\ReSoNaNCe-PC\\AppData\\Local\\Programs\\Python\\Python311\\Lib\\pdb.py',
   'PYMODULE'),
  ('pickle',
   'C:\\Users\\ReSoNaNCe-PC\\AppData\\Local\\Programs\\Python\\Python311\\Lib\\pickle.py',
   'PYMODULE'),
  ('pkg_resources',
   'C:\\Users\\ReSoNaNCe-PC\\AppData\\Local\\Programs\\Python\\Python311\\Lib\\site-packages\\pkg_resources\\__init__.py',
   'PYMODULE'),
  ('pkg_resources._vendor',
   'C:\\Users\\ReSoNaNCe-PC\\AppData\\Local\\Programs\\Python\\Python311\\Lib\\site-packages\\pkg_resources\\_vendor\\__init__.py',
   'PYMODULE'),
  ('pkg_resources._vendor.appdirs',
   'C:\\Users\\ReSoNaNCe-PC\\AppData\\Local\\Programs\\Python\\Python311\\Lib\\site-packages\\pkg_resources\\_vendor\\appdirs.py',
   'PYMODULE'),
  ('pkg_resources._vendor.importlib_resources',
   'C:\\Users\\ReSoNaNCe-PC\\AppData\\Local\\Programs\\Python\\Python311\\Lib\\site-packages\\pkg_resources\\_vendor\\importlib_resources\\__init__.py',
   'PYMODULE'),
  ('pkg_resources._vendor.importlib_resources._adapters',
   'C:\\Users\\ReSoNaNCe-PC\\AppData\\Local\\Programs\\Python\\Python311\\Lib\\site-packages\\pkg_resources\\_vendor\\importlib_resources\\_adapters.py',
   'PYMODULE'),
  ('pkg_resources._vendor.importlib_resources._common',
   'C:\\Users\\ReSoNaNCe-PC\\AppData\\Local\\Programs\\Python\\Python311\\Lib\\site-packages\\pkg_resources\\_vendor\\importlib_resources\\_common.py',
   'PYMODULE'),
  ('pkg_resources._vendor.importlib_resources._compat',
   'C:\\Users\\ReSoNaNCe-PC\\AppData\\Local\\Programs\\Python\\Python311\\Lib\\site-packages\\pkg_resources\\_vendor\\importlib_resources\\_compat.py',
   'PYMODULE'),
  ('pkg_resources._vendor.importlib_resources._itertools',
   'C:\\Users\\ReSoNaNCe-PC\\AppData\\Local\\Programs\\Python\\Python311\\Lib\\site-packages\\pkg_resources\\_vendor\\importlib_resources\\_itertools.py',
   'PYMODULE'),
  ('pkg_resources._vendor.importlib_resources._legacy',
   'C:\\Users\\ReSoNaNCe-PC\\AppData\\Local\\Programs\\Python\\Python311\\Lib\\site-packages\\pkg_resources\\_vendor\\importlib_resources\\_legacy.py',
   'PYMODULE'),
  ('pkg_resources._vendor.importlib_resources.abc',
   'C:\\Users\\ReSoNaNCe-PC\\AppData\\Local\\Programs\\Python\\Python311\\Lib\\site-packages\\pkg_resources\\_vendor\\importlib_resources\\abc.py',
   'PYMODULE'),
  ('pkg_resources._vendor.importlib_resources.readers',
   'C:\\Users\\ReSoNaNCe-PC\\AppData\\Local\\Programs\\Python\\Python311\\Lib\\site-packages\\pkg_resources\\_vendor\\importlib_resources\\readers.py',
   'PYMODULE'),
  ('pkg_resources._vendor.importlib_resources.simple',
   'C:\\Users\\ReSoNaNCe-PC\\AppData\\Local\\Programs\\Python\\Python311\\Lib\\site-packages\\pkg_resources\\_vendor\\importlib_resources\\simple.py',
   'PYMODULE'),
  ('pkg_resources._vendor.jaraco',
   'C:\\Users\\ReSoNaNCe-PC\\AppData\\Local\\Programs\\Python\\Python311\\Lib\\site-packages\\pkg_resources\\_vendor\\jaraco\\__init__.py',
   'PYMODULE'),
  ('pkg_resources._vendor.jaraco.context',
   'C:\\Users\\ReSoNaNCe-PC\\AppData\\Local\\Programs\\Python\\Python311\\Lib\\site-packages\\pkg_resources\\_vendor\\jaraco\\context.py',
   'PYMODULE'),
  ('pkg_resources._vendor.jaraco.functools',
   'C:\\Users\\ReSoNaNCe-PC\\AppData\\Local\\Programs\\Python\\Python311\\Lib\\site-packages\\pkg_resources\\_vendor\\jaraco\\functools.py',
   'PYMODULE'),
  ('pkg_resources._vendor.jaraco.text',
   'C:\\Users\\ReSoNaNCe-PC\\AppData\\Local\\Programs\\Python\\Python311\\Lib\\site-packages\\pkg_resources\\_vendor\\jaraco\\text\\__init__.py',
   'PYMODULE'),
  ('pkg_resources._vendor.more_itertools',
   'C:\\Users\\ReSoNaNCe-PC\\AppData\\Local\\Programs\\Python\\Python311\\Lib\\site-packages\\pkg_resources\\_vendor\\more_itertools\\__init__.py',
   'PYMODULE'),
  ('pkg_resources._vendor.more_itertools.more',
   'C:\\Users\\ReSoNaNCe-PC\\AppData\\Local\\Programs\\Python\\Python311\\Lib\\site-packages\\pkg_resources\\_vendor\\more_itertools\\more.py',
   'PYMODULE'),
  ('pkg_resources._vendor.more_itertools.recipes',
   'C:\\Users\\ReSoNaNCe-PC\\AppData\\Local\\Programs\\Python\\Python311\\Lib\\site-packages\\pkg_resources\\_vendor\\more_itertools\\recipes.py',
   'PYMODULE'),
  ('pkg_resources._vendor.packaging',
   'C:\\Users\\ReSoNaNCe-PC\\AppData\\Local\\Programs\\Python\\Python311\\Lib\\site-packages\\pkg_resources\\_vendor\\packaging\\__init__.py',
   'PYMODULE'),
  ('pkg_resources._vendor.packaging.__about__',
   'C:\\Users\\ReSoNaNCe-PC\\AppData\\Local\\Programs\\Python\\Python311\\Lib\\site-packages\\pkg_resources\\_vendor\\packaging\\__about__.py',
   'PYMODULE'),
  ('pkg_resources._vendor.packaging._manylinux',
   'C:\\Users\\ReSoNaNCe-PC\\AppData\\Local\\Programs\\Python\\Python311\\Lib\\site-packages\\pkg_resources\\_vendor\\packaging\\_manylinux.py',
   'PYMODULE'),
  ('pkg_resources._vendor.packaging._musllinux',
   'C:\\Users\\ReSoNaNCe-PC\\AppData\\Local\\Programs\\Python\\Python311\\Lib\\site-packages\\pkg_resources\\_vendor\\packaging\\_musllinux.py',
   'PYMODULE'),
  ('pkg_resources._vendor.packaging._structures',
   'C:\\Users\\ReSoNaNCe-PC\\AppData\\Local\\Programs\\Python\\Python311\\Lib\\site-packages\\pkg_resources\\_vendor\\packaging\\_structures.py',
   'PYMODULE'),
  ('pkg_resources._vendor.packaging.markers',
   'C:\\Users\\ReSoNaNCe-PC\\AppData\\Local\\Programs\\Python\\Python311\\Lib\\site-packages\\pkg_resources\\_vendor\\packaging\\markers.py',
   'PYMODULE'),
  ('pkg_resources._vendor.packaging.requirements',
   'C:\\Users\\ReSoNaNCe-PC\\AppData\\Local\\Programs\\Python\\Python311\\Lib\\site-packages\\pkg_resources\\_vendor\\packaging\\requirements.py',
   'PYMODULE'),
  ('pkg_resources._vendor.packaging.specifiers',
   'C:\\Users\\ReSoNaNCe-PC\\AppData\\Local\\Programs\\Python\\Python311\\Lib\\site-packages\\pkg_resources\\_vendor\\packaging\\specifiers.py',
   'PYMODULE'),
  ('pkg_resources._vendor.packaging.tags',
   'C:\\Users\\ReSoNaNCe-PC\\AppData\\Local\\Programs\\Python\\Python311\\Lib\\site-packages\\pkg_resources\\_vendor\\packaging\\tags.py',
   'PYMODULE'),
  ('pkg_resources._vendor.packaging.utils',
   'C:\\Users\\ReSoNaNCe-PC\\AppData\\Local\\Programs\\Python\\Python311\\Lib\\site-packages\\pkg_resources\\_vendor\\packaging\\utils.py',
   'PYMODULE'),
  ('pkg_resources._vendor.packaging.version',
   'C:\\Users\\ReSoNaNCe-PC\\AppData\\Local\\Programs\\Python\\Python311\\Lib\\site-packages\\pkg_resources\\_vendor\\packaging\\version.py',
   'PYMODULE'),
  ('pkg_resources._vendor.pyparsing',
   'C:\\Users\\ReSoNaNCe-PC\\AppData\\Local\\Programs\\Python\\Python311\\Lib\\site-packages\\pkg_resources\\_vendor\\pyparsing\\__init__.py',
   'PYMODULE'),
  ('pkg_resources._vendor.pyparsing.actions',
   'C:\\Users\\ReSoNaNCe-PC\\AppData\\Local\\Programs\\Python\\Python311\\Lib\\site-packages\\pkg_resources\\_vendor\\pyparsing\\actions.py',
   'PYMODULE'),
  ('pkg_resources._vendor.pyparsing.common',
   'C:\\Users\\ReSoNaNCe-PC\\AppData\\Local\\Programs\\Python\\Python311\\Lib\\site-packages\\pkg_resources\\_vendor\\pyparsing\\common.py',
   'PYMODULE'),
  ('pkg_resources._vendor.pyparsing.core',
   'C:\\Users\\ReSoNaNCe-PC\\AppData\\Local\\Programs\\Python\\Python311\\Lib\\site-packages\\pkg_resources\\_vendor\\pyparsing\\core.py',
   'PYMODULE'),
  ('pkg_resources._vendor.pyparsing.diagram',
   'C:\\Users\\ReSoNaNCe-PC\\AppData\\Local\\Programs\\Python\\Python311\\Lib\\site-packages\\pkg_resources\\_vendor\\pyparsing\\diagram\\__init__.py',
   'PYMODULE'),
  ('pkg_resources._vendor.pyparsing.exceptions',
   'C:\\Users\\ReSoNaNCe-PC\\AppData\\Local\\Programs\\Python\\Python311\\Lib\\site-packages\\pkg_resources\\_vendor\\pyparsing\\exceptions.py',
   'PYMODULE'),
  ('pkg_resources._vendor.pyparsing.helpers',
   'C:\\Users\\ReSoNaNCe-PC\\AppData\\Local\\Programs\\Python\\Python311\\Lib\\site-packages\\pkg_resources\\_vendor\\pyparsing\\helpers.py',
   'PYMODULE'),
  ('pkg_resources._vendor.pyparsing.results',
   'C:\\Users\\ReSoNaNCe-PC\\AppData\\Local\\Programs\\Python\\Python311\\Lib\\site-packages\\pkg_resources\\_vendor\\pyparsing\\results.py',
   'PYMODULE'),
  ('pkg_resources._vendor.pyparsing.testing',
   'C:\\Users\\ReSoNaNCe-PC\\AppData\\Local\\Programs\\Python\\Python311\\Lib\\site-packages\\pkg_resources\\_vendor\\pyparsing\\testing.py',
   'PYMODULE'),
  ('pkg_resources._vendor.pyparsing.unicode',
   'C:\\Users\\ReSoNaNCe-PC\\AppData\\Local\\Programs\\Python\\Python311\\Lib\\site-packages\\pkg_resources\\_vendor\\pyparsing\\unicode.py',
   'PYMODULE'),
  ('pkg_resources._vendor.pyparsing.util',
   'C:\\Users\\ReSoNaNCe-PC\\AppData\\Local\\Programs\\Python\\Python311\\Lib\\site-packages\\pkg_resources\\_vendor\\pyparsing\\util.py',
   'PYMODULE'),
  ('pkg_resources._vendor.zipp',
   'C:\\Users\\ReSoNaNCe-PC\\AppData\\Local\\Programs\\Python\\Python311\\Lib\\site-packages\\pkg_resources\\_vendor\\zipp.py',
   'PYMODULE'),
  ('pkg_resources.extern',
   'C:\\Users\\ReSoNaNCe-PC\\AppData\\Local\\Programs\\Python\\Python311\\Lib\\site-packages\\pkg_resources\\extern\\__init__.py',
   'PYMODULE'),
  ('pkgutil',
   'C:\\Users\\ReSoNaNCe-PC\\AppData\\Local\\Programs\\Python\\Python311\\Lib\\pkgutil.py',
   'PYMODULE'),
  ('platform',
   'C:\\Users\\ReSoNaNCe-PC\\AppData\\Local\\Programs\\Python\\Python311\\Lib\\platform.py',
   'PYMODULE'),
  ('player',
   'C:\\xampp\\htdocs\\ai generated\\3d\\gpt4\\player.py',
   'PYMODULE'),
  ('plistlib',
   'C:\\Users\\ReSoNaNCe-PC\\AppData\\Local\\Programs\\Python\\Python311\\Lib\\plistlib.py',
   'PYMODULE'),
  ('pprint',
   'C:\\Users\\ReSoNaNCe-PC\\AppData\\Local\\Programs\\Python\\Python311\\Lib\\pprint.py',
   'PYMODULE'),
  ('py_compile',
   'C:\\Users\\ReSoNaNCe-PC\\AppData\\Local\\Programs\\Python\\Python311\\Lib\\py_compile.py',
   'PYMODULE'),
  ('pydoc',
   'C:\\Users\\ReSoNaNCe-PC\\AppData\\Local\\Programs\\Python\\Python311\\Lib\\pydoc.py',
   'PYMODULE'),
  ('pydoc_data',
   'C:\\Users\\ReSoNaNCe-PC\\AppData\\Local\\Programs\\Python\\Python311\\Lib\\pydoc_data\\__init__.py',
   'PYMODULE'),
  ('pydoc_data.topics',
   'C:\\Users\\ReSoNaNCe-PC\\AppData\\Local\\Programs\\Python\\Python311\\Lib\\pydoc_data\\topics.py',
   'PYMODULE'),
  ('pygame',
   'C:\\Users\\ReSoNaNCe-PC\\AppData\\Local\\Programs\\Python\\Python311\\Lib\\site-packages\\pygame\\__init__.py',
   'PYMODULE'),
  ('pygame.colordict',
   'C:\\Users\\ReSoNaNCe-PC\\AppData\\Local\\Programs\\Python\\Python311\\Lib\\site-packages\\pygame\\colordict.py',
   'PYMODULE'),
  ('pygame.cursors',
   'C:\\Users\\ReSoNaNCe-PC\\AppData\\Local\\Programs\\Python\\Python311\\Lib\\site-packages\\pygame\\cursors.py',
   'PYMODULE'),
  ('pygame.fastevent',
   'C:\\Users\\ReSoNaNCe-PC\\AppData\\Local\\Programs\\Python\\Python311\\Lib\\site-packages\\pygame\\fastevent.py',
   'PYMODULE'),
  ('pygame.ftfont',
   'C:\\Users\\ReSoNaNCe-PC\\AppData\\Local\\Programs\\Python\\Python311\\Lib\\site-packages\\pygame\\ftfont.py',
   'PYMODULE'),
  ('pygame.macosx',
   'C:\\Users\\ReSoNaNCe-PC\\AppData\\Local\\Programs\\Python\\Python311\\Lib\\site-packages\\pygame\\macosx.py',
   'PYMODULE'),
  ('pygame.pkgdata',
   'C:\\Users\\ReSoNaNCe-PC\\AppData\\Local\\Programs\\Python\\Python311\\Lib\\site-packages\\pygame\\pkgdata.py',
   'PYMODULE'),
  ('pygame.sndarray',
   'C:\\Users\\ReSoNaNCe-PC\\AppData\\Local\\Programs\\Python\\Python311\\Lib\\site-packages\\pygame\\sndarray.py',
   'PYMODULE'),
  ('pygame.sprite',
   'C:\\Users\\ReSoNaNCe-PC\\AppData\\Local\\Programs\\Python\\Python311\\Lib\\site-packages\\pygame\\sprite.py',
   'PYMODULE'),
  ('pygame.surfarray',
   'C:\\Users\\ReSoNaNCe-PC\\AppData\\Local\\Programs\\Python\\Python311\\Lib\\site-packages\\pygame\\surfarray.py',
   'PYMODULE'),
  ('pygame.sysfont',
   'C:\\Users\\ReSoNaNCe-PC\\AppData\\Local\\Programs\\Python\\Python311\\Lib\\site-packages\\pygame\\sysfont.py',
   'PYMODULE'),
  ('pygame.threads',
   'C:\\Users\\ReSoNaNCe-PC\\AppData\\Local\\Programs\\Python\\Python311\\Lib\\site-packages\\pygame\\threads\\__init__.py',
   'PYMODULE'),
  ('pygame.version',
   'C:\\Users\\ReSoNaNCe-PC\\AppData\\Local\\Programs\\Python\\Python311\\Lib\\site-packages\\pygame\\version.py',
   'PYMODULE'),
  ('queue',
   'C:\\Users\\ReSoNaNCe-PC\\AppData\\Local\\Programs\\Python\\Python311\\Lib\\queue.py',
   'PYMODULE'),
  ('quopri',
   'C:\\Users\\ReSoNaNCe-PC\\AppData\\Local\\Programs\\Python\\Python311\\Lib\\quopri.py',
   'PYMODULE'),
  ('random',
   'C:\\Users\\ReSoNaNCe-PC\\AppData\\Local\\Programs\\Python\\Python311\\Lib\\random.py',
   'PYMODULE'),
  ('raycaster',
   'C:\\xampp\\htdocs\\ai generated\\3d\\gpt4\\raycaster.py',
   'PYMODULE'),
  ('runpy',
   'C:\\Users\\ReSoNaNCe-PC\\AppData\\Local\\Programs\\Python\\Python311\\Lib\\runpy.py',
   'PYMODULE'),
  ('secrets',
   'C:\\Users\\ReSoNaNCe-PC\\AppData\\Local\\Programs\\Python\\Python311\\Lib\\secrets.py',
   'PYMODULE'),
  ('selectors',
   'C:\\Users\\ReSoNaNCe-PC\\AppData\\Local\\Programs\\Python\\Python311\\Lib\\selectors.py',
   'PYMODULE'),
  ('settings',
   'C:\\xampp\\htdocs\\ai generated\\3d\\gpt4\\settings.py',
   'PYMODULE'),
  ('shlex',
   'C:\\Users\\ReSoNaNCe-PC\\AppData\\Local\\Programs\\Python\\Python311\\Lib\\shlex.py',
   'PYMODULE'),
  ('shutil',
   'C:\\Users\\ReSoNaNCe-PC\\AppData\\Local\\Programs\\Python\\Python311\\Lib\\shutil.py',
   'PYMODULE'),
  ('signal',
   'C:\\Users\\ReSoNaNCe-PC\\AppData\\Local\\Programs\\Python\\Python311\\Lib\\signal.py',
   'PYMODULE'),
  ('socket',
   'C:\\Users\\ReSoNaNCe-PC\\AppData\\Local\\Programs\\Python\\Python311\\Lib\\socket.py',
   'PYMODULE'),
  ('socketserver',
   'C:\\Users\\ReSoNaNCe-PC\\AppData\\Local\\Programs\\Python\\Python311\\Lib\\socketserver.py',
   'PYMODULE'),
  ('ssl',
   'C:\\Users\\ReSoNaNCe-PC\\AppData\\Local\\Programs\\Python\\Python311\\Lib\\ssl.py',
   'PYMODULE'),
  ('statistics',
   'C:\\Users\\ReSoNaNCe-PC\\AppData\\Local\\Programs\\Python\\Python311\\Lib\\statistics.py',
   'PYMODULE'),
  ('string',
   'C:\\Users\\ReSoNaNCe-PC\\AppData\\Local\\Programs\\Python\\Python311\\Lib\\string.py',
   'PYMODULE'),
  ('stringprep',
   'C:\\Users\\ReSoNaNCe-PC\\AppData\\Local\\Programs\\Python\\Python311\\Lib\\stringprep.py',
   'PYMODULE'),
  ('subprocess',
   'C:\\Users\\ReSoNaNCe-PC\\AppData\\Local\\Programs\\Python\\Python311\\Lib\\subprocess.py',
   'PYMODULE'),
  ('sysconfig',
   'C:\\Users\\ReSoNaNCe-PC\\AppData\\Local\\Programs\\Python\\Python311\\Lib\\sysconfig.py',
   'PYMODULE'),
  ('tarfile',
   'C:\\Users\\ReSoNaNCe-PC\\AppData\\Local\\Programs\\Python\\Python311\\Lib\\tarfile.py',
   'PYMODULE'),
  ('tempfile',
   'C:\\Users\\ReSoNaNCe-PC\\AppData\\Local\\Programs\\Python\\Python311\\Lib\\tempfile.py',
   'PYMODULE'),
  ('textwrap',
   'C:\\Users\\ReSoNaNCe-PC\\AppData\\Local\\Programs\\Python\\Python311\\Lib\\textwrap.py',
   'PYMODULE'),
  ('threading',
   'C:\\Users\\ReSoNaNCe-PC\\AppData\\Local\\Programs\\Python\\Python311\\Lib\\threading.py',
   'PYMODULE'),
  ('token',
   'C:\\Users\\ReSoNaNCe-PC\\AppData\\Local\\Programs\\Python\\Python311\\Lib\\token.py',
   'PYMODULE'),
  ('tokenize',
   'C:\\Users\\ReSoNaNCe-PC\\AppData\\Local\\Programs\\Python\\Python311\\Lib\\tokenize.py',
   'PYMODULE'),
  ('tracemalloc',
   'C:\\Users\\ReSoNaNCe-PC\\AppData\\Local\\Programs\\Python\\Python311\\Lib\\tracemalloc.py',
   'PYMODULE'),
  ('tty',
   'C:\\Users\\ReSoNaNCe-PC\\AppData\\Local\\Programs\\Python\\Python311\\Lib\\tty.py',
   'PYMODULE'),
  ('typing',
   'C:\\Users\\ReSoNaNCe-PC\\AppData\\Local\\Programs\\Python\\Python311\\Lib\\typing.py',
   'PYMODULE'),
  ('typing_extensions',
   'C:\\Users\\ReSoNaNCe-PC\\AppData\\Local\\Programs\\Python\\Python311\\Lib\\site-packages\\typing_extensions.py',
   'PYMODULE'),
  ('urllib',
   'C:\\Users\\ReSoNaNCe-PC\\AppData\\Local\\Programs\\Python\\Python311\\Lib\\urllib\\__init__.py',
   'PYMODULE'),
  ('urllib.error',
   'C:\\Users\\ReSoNaNCe-PC\\AppData\\Local\\Programs\\Python\\Python311\\Lib\\urllib\\error.py',
   'PYMODULE'),
  ('urllib.parse',
   'C:\\Users\\ReSoNaNCe-PC\\AppData\\Local\\Programs\\Python\\Python311\\Lib\\urllib\\parse.py',
   'PYMODULE'),
  ('urllib.request',
   'C:\\Users\\ReSoNaNCe-PC\\AppData\\Local\\Programs\\Python\\Python311\\Lib\\urllib\\request.py',
   'PYMODULE'),
  ('urllib.response',
   'C:\\Users\\ReSoNaNCe-PC\\AppData\\Local\\Programs\\Python\\Python311\\Lib\\urllib\\response.py',
   'PYMODULE'),
  ('webbrowser',
   'C:\\Users\\ReSoNaNCe-PC\\AppData\\Local\\Programs\\Python\\Python311\\Lib\\webbrowser.py',
   'PYMODULE'),
  ('xml',
   'C:\\Users\\ReSoNaNCe-PC\\AppData\\Local\\Programs\\Python\\Python311\\Lib\\xml\\__init__.py',
   'PYMODULE'),
  ('xml.parsers',
   'C:\\Users\\ReSoNaNCe-PC\\AppData\\Local\\Programs\\Python\\Python311\\Lib\\xml\\parsers\\__init__.py',
   'PYMODULE'),
  ('xml.parsers.expat',
   'C:\\Users\\ReSoNaNCe-PC\\AppData\\Local\\Programs\\Python\\Python311\\Lib\\xml\\parsers\\expat.py',
   'PYMODULE'),
  ('xml.sax',
   'C:\\Users\\ReSoNaNCe-PC\\AppData\\Local\\Programs\\Python\\Python311\\Lib\\xml\\sax\\__init__.py',
   'PYMODULE'),
  ('xml.sax._exceptions',
   'C:\\Users\\ReSoNaNCe-PC\\AppData\\Local\\Programs\\Python\\Python311\\Lib\\xml\\sax\\_exceptions.py',
   'PYMODULE'),
  ('xml.sax.expatreader',
   'C:\\Users\\ReSoNaNCe-PC\\AppData\\Local\\Programs\\Python\\Python311\\Lib\\xml\\sax\\expatreader.py',
   'PYMODULE'),
  ('xml.sax.handler',
   'C:\\Users\\ReSoNaNCe-PC\\AppData\\Local\\Programs\\Python\\Python311\\Lib\\xml\\sax\\handler.py',
   'PYMODULE'),
  ('xml.sax.saxutils',
   'C:\\Users\\ReSoNaNCe-PC\\AppData\\Local\\Programs\\Python\\Python311\\Lib\\xml\\sax\\saxutils.py',
   'PYMODULE'),
  ('xml.sax.xmlreader',
   'C:\\Users\\ReSoNaNCe-PC\\AppData\\Local\\Programs\\Python\\Python311\\Lib\\xml\\sax\\xmlreader.py',
   'PYMODULE'),
  ('xmlrpc',
   'C:\\Users\\ReSoNaNCe-PC\\AppData\\Local\\Programs\\Python\\Python311\\Lib\\xmlrpc\\__init__.py',
   'PYMODULE'),
  ('xmlrpc.client',
   'C:\\Users\\ReSoNaNCe-PC\\AppData\\Local\\Programs\\Python\\Python311\\Lib\\xmlrpc\\client.py',
   'PYMODULE'),
  ('zipfile',
   'C:\\Users\\ReSoNaNCe-PC\\AppData\\Local\\Programs\\Python\\Python311\\Lib\\zipfile.py',
   'PYMODULE'),
  ('zipimport',
   'C:\\Users\\ReSoNaNCe-PC\\AppData\\Local\\Programs\\Python\\Python311\\Lib\\zipimport.py',
   'PYMODULE')])
