{
  "index": "/index.html",
  "assetGroups": [{
    "name": "Brew",
    "installMode": "prefetch",
    "resources": {
      "files": [
        "/index.html",
        "/manifest.json",
        "/ngsw-worker.js"
      ],
      "versionedFiles": [
        "/build/*.js",
        "/build/*.css"
      ],
      "urls": []
   }
  }, {
    "name": "assets",
    "installMode": "lazy",
    "updateMode": "prefetch",
    "resources": {
      "files": [
        "/assets/**"
      ],
      "urls": [
        "https://fonts.googleapis.com/**"
      ]
    }
  }]
}
