{
	"info": {
		"_postman_id": "df605a61-fc87-46ff-8b99-3e16c77bb72f",
		"name": "ctws",
		"schema": "https://schema.getpostman.com/json/collection/v2.1.0/collection.json"
	},
	"item": [
		{
			"name": "smoke-api-test",
			"event": [
				{
					"listen": "test",
					"script": {
						"id": "78842ce1-c2e7-4b40-840f-5e01779169ac",
						"exec": [
							"pm.test(\"Status code is 200\", function () {\r",
							"    pm.response.to.have.status(200);\r",
							"});\r",
							"\r",
							"pm.test(\"Response content is OK\", function () {\r",
							"    pm.expect(pm.response.text()).to.include(\"Cool GET REST API\");\r",
							"});"
						],
						"type": "text/javascript"
					}
				}
			],
			"request": {
				"method": "GET",
				"header": [],
				"url": {
					"raw": "arturas.listvan.gitlab.io/testcon2020arturas/api/",
					"protocol": "http",
					"host": [
						"arturas",
						"listvan",
						"gitlab",
						"io"
					],
					"path": [
						"testcon2020arturas",
						"api",
						""
					]
				}
			},
			"response": []
		}
	],
	"protocolProfileBehavior": {}
}