﻿{
  "profiles": {
    "WorkerServiceBook": {
      "commandName": "Project",
      "dotnetRunMessages": "true",
      "environmentVariables": {
        "DOTNET_ENVIRONMENT": "Development"
      }
    }
  }
}
