{
  "openapi": "3.0.2",
  "info": {
    "title": "API Title",
    "version": "1.0"
  },
  "components": {
    "parameters": {
      "client_id": {
        "name": "client_id",
        "in": "query",
        "required": true,
        "description": "ID клиента",
        "schema": {
          "type": "string",
          "format": "uuid"
        },
        "examples": {
          "Client ID": {
            "value": "857e1f1f-13c8-44be-8f6c-c7d9c36447d6"
          }
        }
      }
    },
    "schemas": {
      "Sports": {
        "type": "string",
        "enum": [
          "soccer",
          "basketball",
          "baseball",
          "icehockey",
          "tennis",
          "football"
        ]
      },
      "MarketGroup": {
        "type": "string",
        "enum": [
          "MONEY_LINE",
          "TWO_WAY_MONEY_LINE",
          "DOUBLE_CHANCE",
          "HANDICAP",
          "TOTAL_SCORE",
          "HOME_TOTAL_SCORE",
          "AWAY_TOTAL_SCORE",
          "BOTH_TEAM_TO_SCORE",
          "HOME_TEAM_TO_SCORE",
          "AWAY_TEAM_TO_SCORE",
          "NEXT_TEAM_TO_SCORE",
          "HOME_TEAM_TO_WIN_TO_NIL",
          "AWAY_TEAM_TO_WIN_TO_NIL",
          "TOTAL_SCORE_BY_GAMES",
          "HANDICAP_BY_GAMES",
          "HANDICAP_BY_SETS",
          "ADVANCE_TO_THE_NEXT_ROUND",
          "CORRECT_SCORE"
        ]
      },
      "DealingTool": {
        "type": "string",
        "enum": [
          "DEAL",
          "PARLAY_DEAL",
          "RANDOM_BET",
          "QUOTE",
          "MULTI_QUOTE",
          "PARLAY_QUOTE",
          "ORDER",
          "PARLAY_SYSTEM_DEAL",
          "CUSTOM"
        ]
      },
      "LimitType": {
        "type": "string",
        "enum": [
          "RANGE_LIMIT",
          "FIXED_RISK_LIMIT",
          "FIXED_WIN_LIMIT"
        ]
      },
      "EventAvailability": {
        "type": "object",
        "properties": {
          "id": {
            "type": "string",
            "format": "uuid"
          },
          "expire_at": {
            "type": "string",
            "format": "date-time",
            "description": "Для prematch"
          },
          "expire_live_minute": {
            "type": "integer",
            "minimum": 0,
            "description": "Для live"
          },
          "availability": {
            "type": "array",
            "items": {
              "type": "object",
              "properties": {
                "period_id": {
                  "type": "string",
                  "format": "uuid"
                },
                "market_group": {
                  "$ref": "#/components/schemas/MarketGroup"
                },
                "gl_shift": {
                  "description": "для маркетов без gl_shift тут будет 0",
                  "type": "integer",
                  "minimum": 0
                },
                "available_tools": {
                  "type": "array",
                  "items": {
                    "$ref": "#/components/schemas/DealingTool"
                  }
                }
              }
            }
          }
        }
      },
      "EventLimits": {
        "type": "object",
        "properties": {
          "id": {
            "type": "string",
            "format": "uuid"
          },
          "expire_at": {
            "type": "string",
            "format": "date-time",
            "description": "Для prematch; Дата после которой текущие настройки лимитов уже не актуальны; Нужно учесть и время окончания окна, и настройку времени в пресете лимитов"
          },
          "expire_live_minute": {
            "type": "integer",
            "minimum": 0,
            "description": "Для live; Аналогично expire_at"
          },
          "limit_settings": {
            "type": "array",
            "items": {
              "type": "object",
              "properties": {
                "period_id": {
                  "type": "string",
                  "format": "uuid"
                },
                "market_group": {
                  "$ref": "#/components/schemas/MarketGroup"
                },
                "tool": {
                  "$ref": "#/components/schemas/DealingTool"
                },
                "gl_shift": {
                  "description": "для маркетов без gl_shift тут будет 0",
                  "type": "integer",
                  "minimum": 0
                },
                "limits": {
                  "oneOf": [
                    {
                      "$ref": "#/components/schemas/RangeLimit"
                    },
                    {
                      "$ref": "#/components/schemas/FixedRiskLimit"
                    },
                    {
                      "$ref": "#/components/schemas/FixedWinLimit"
                    }
                  ],
                  "discriminator": {
                    "propertyName": "limit_type",
                    "mapping": {
                      "RANGE_LIMIT": "#/components/schemas/RangeLimit",
                      "FIXED_RISK_LIMIT": "#/components/schemas/FixedRiskLimit",
                      "FIXED_WIN_LIMIT": "#/components/schemas/FixedWinLimit"
                    }
                  }
                }
              }
            }
          }
        }
      },
      "RangeLimit": {
        "description": "limit_type = RANGE_LIMIT",
        "type": "object",
        "properties": {
          "limit_type": {
            "$ref": "#/components/schemas/LimitType"
          },
          "min_to_risk": {
            "type": "integer"
          },
          "max_to_risk": {
            "type": "integer"
          },
          "max_to_win": {
            "type": "integer"
          }
        }
      },
      "FixedRiskLimit": {
        "description": "limit_type = FIXED_RISK_LIMIT",
        "type": "object",
        "properties": {
          "limit_type": {
            "$ref": "#/components/schemas/LimitType"
          },
          "values": {
            "type": "array",
            "items": {
              "type": "integer"
            }
          }
        }
      },
      "FixedWinLimit": {
        "description": "limit_type = FIXED_WIN_LIMIT",
        "type": "object",
        "properties": {
          "limit_type": {
            "$ref": "#/components/schemas/LimitType"
          },
          "values": {
            "type": "array",
            "items": {
              "type": "integer"
            }
          }
        }
      }
    }
  },
  "paths": {
    "/api/users-gateway/v1/events/": {
      "post": {
        "operationId": "getEventsInfo",
        "description": "Позвращает подробную информацию по ивентам",
        "tags": [
          "Users Gateway"
        ],
        "requestBody": {
          "required": true,
          "content": {
            "application/json": {
              "schema": {
                "type": "object",
                "properties": {
                  "client_id": {
                    "type": "string",
                    "format": "uuid"
                  },
                  "events": {
                    "type": "array",
                    "items": {
                      "type": "string",
                      "format": "uuid"
                    }
                  }
                }
              }
            }
          }
        },
        "responses": {
          "200": {
            "description": "OK"
          }
        }
      }
    },
    "/api/users-gateway/v1/starred-events/": {
      "get": {
        "operationId": "getStarredEvents",
        "description": "Возвращает список ивентов, которые юзер пометил как избранные",
        "tags": [
          "Users Gateway"
        ],
        "parameters": [
          {
            "$ref": "#/components/parameters/client_id"
          }
        ],
        "responses": {
          "200": {
            "description": "OK"
          }
        }
      }
    },
    "/api/users-gateway/v1/disabled-events/": {
      "get": {
        "operationId": "getDisabledInfo",
        "description": "Возвращается список матчей, которые для клиента задизейблены",
        "tags": [
          "Users Gateway"
        ],
        "parameters": [
          {
            "$ref": "#/components/parameters/client_id"
          }
        ],
        "responses": {
          "200": {
            "description": "OK"
          }
        }
      }
    },
    "/api/users-gateway/v1/availability/": {
      "post": {
        "operationId": "getAvailability",
        "description": "Возвращает доступность матчей для переданного клиента и списка матчей",
        "tags": [
          "Users Gateway"
        ],
        "requestBody": {
          "required": true,
          "content": {
            "application/json": {
              "schema": {
                "type": "object",
                "properties": {
                  "client_id": {
                    "type": "string",
                    "format": "uuid"
                  },
                  "events": {
                    "type": "array",
                    "items": {
                      "type": "string",
                      "format": "uuid"
                    }
                  }
                }
              }
            }
          }
        },
        "responses": {
          "200": {
            "description": "Ok",
            "content": {
              "application/json": {
                "schema": {
                  "type": "object",
                  "properties": {
                    "events": {
                      "type": "array",
                      "items": {
                        "$ref": "#/components/schemas/EventAvailability"
                      }
                    }
                  }
                }
              }
            }
          }
        }
      }
    },
    "/api/users-gateway/v1/availabile-events/": {
      "post": {
        "operationId": "getAvailabileEvents",
        "description": "Возвращает список доступных для просмотра в расписании ивентов, которые попадают под переданный фильтр, а так же настройки доступности в этих ивентах",
        "tags": [
          "Users Gateway"
        ],
        "requestBody": {
          "required": true,
          "content": {
            "application/json": {
              "schema": {
                "type": "object",
                "required": [
                  "client_id"
                ],
                "properties": {
                  "client_id": {
                    "type": "string",
                    "format": "uuid"
                  },
                  "sport": {
                    "description": "Если не передан, то выдаются матчи по всем спортам",
                    "$ref": "#/components/schemas/Sports"
                  },
                  "date_from": {
                    "type": "string",
                    "format": "date",
                    "description": "Фильтр по дате event.date >= date_from; если не передано, то берется по сегодняшнему дню"
                  },
                  "date_to": {
                    "type": "string",
                    "format": "date",
                    "description": "Фильтр по дате event.date <= date_from; если не передано, то берется по сегодняшнему дню"
                  }
                }
              }
            }
          }
        },
        "responses": {
          "200": {
            "description": "OK",
            "content": {
              "application/json": {
                "schema": {
                  "type": "object",
                  "properties": {
                    "events": {
                      "type": "array",
                      "items": {
                        "$ref": "#/components/schemas/EventAvailability"
                      }
                    }
                  }
                }
              }
            }
          }
        }
      }
    },
    "/api/users-gateway/v1/event-limits/": {
      "post": {
        "operationId": "getEventLimits",
        "description": "Возвращает лимиты по ставкам для переданного клиента и списка матчей",
        "tags": [
          "Users Gateway"
        ],
        "requestBody": {
          "required": true,
          "content": {
            "application/json": {
              "schema": {
                "type": "object",
                "properties": {
                  "client_id": {
                    "type": "string",
                    "format": "uuid"
                  },
                  "events": {
                    "type": "array",
                    "items": {
                      "type": "string",
                      "format": "uuid"
                    }
                  }
                }
              }
            }
          }
        },
        "responses": {
          "200": {
            "description": "OK",
            "content": {
              "application/json": {
                "schema": {
                  "type": "object",
                  "properties": {
                    "events": {
                      "type": "array",
                      "items": {
                        "$ref": "#/components/schemas/EventLimits"
                      }
                    }
                  }
                }
              }
            }
          }
        }
      }
    }
  }
}