[
  {
    "productName": "Guild F-20E",
    "price": "1.350",
    "imgURL": "https://theguitarcompany.nl/wp-content/uploads/2020/01/tgc-guild-f-20-2012-1.png",
    "productArticle": 100,
    "productColor": "yellow"
  },
  {
    "productName": "Gretsch 6120",
    "price": "3.000",
    "imgURL": "https://theguitarcompany.nl/wp-content/uploads/2022/07/tgc-gretsch-6120-1967-1.jpg",
    "productArticle": 101,
    "productColor": "orange"
  },
  {
    "productName": "Gibson L-5CES",
    "price": "4.550",
    "imgURL": "https://theguitarcompany.nl/wp-content/uploads/2022/06/tgc-gibson-l-5-1991-3.jpg",
    "productArticle": 102,
    "productColor": "black"
  },
  {
    "productName": "Ludwig Dixie 1932",
    "price": "4.350",
    "imgURL": "https://theguitarcompany.nl/wp-content/uploads/2020/05/tgc-ludwig-tenor-banjo-13.jpg",
    "productArticle": 103,
    "productColor": "white"
  },
  {
    "productName": "National Rosita 1930s",
    "price": "2.050",
    "imgURL": "https://theguitarcompany.nl/wp-content/uploads/2020/05/tgc-national-rosita-1930s-1.jpg",
    "productArticle": 104,
    "productColor": "metal"
  },
  {
    "productName": "Kalamazoo 1940",
    "price": "1.054",
    "imgURL": "https://theguitarcompany.nl/wp-content/uploads/2019/09/tgc-detail-kalamazoo-oriole-crinkle-1940.jpg",
    "productArticle": 105,
    "productColor": "chocolate"
  },
  {
    "productName": "Fender St 60 2005",
    "price": "4.444",
    "imgURL": "https://theguitarcompany.nl/wp-content/uploads/2021/12/tgc-fender-strat-nos-1960-5.png",
    "productArticle": 106,
    "productColor": "creme"
  },
  {
    "productName": "Gibson Trini 1968",
    "price": "3.894",
    "imgURL": "https://theguitarcompany.nl/wp-content/uploads/2022/02/tgc-gibson-trini-lopez-deluxe-1968-1.png",
    "productArticle": 107,
    "productColor": "red/yellow"
  },
  {
    "productName": "Airline Bobkat 1960s",
    "price": "2.300",
    "imgURL": "https://theguitarcompany.nl/wp-content/uploads/2022/03/tgc-airline-bobkat-1964-1.png",
    "productArticle": 108,
    "productColor": "red/yellow"
  },
  {
    "productName": "Gibson R8S 2016",
    "price": "7.844",
    "imgURL": "https://theguitarcompany.nl/wp-content/uploads/2020/03/tgc-gibson-lp-r8s-2016-5.jpg",
    "productArticle": 109,
    "productColor": "yellow"
  }
]