<?xml version="1.0" encoding="utf-8"?>
<!-- Generator: Adobe Illustrator 17.0.0, SVG Export Plug-In . SVG Version: 6.00 Build 0)  -->
<!DOCTYPE svg PUBLIC "-//W3C//DTD SVG 1.1//EN" "http://www.w3.org/Graphics/SVG/1.1/DTD/svg11.dtd">
<svg version="1.1" xmlns="http://www.w3.org/2000/svg" xmlns:xlink="http://www.w3.org/1999/xlink" x="0px" y="0px"
	 width="4251.97px" height="4818.9px" viewBox="0 0 4251.97 4818.9" enable-background="new 0 0 4251.97 4818.9"
	 xml:space="preserve">
<g id="tracés_de_découpe">
	<path fill="none" stroke="#000000" stroke-width="3" stroke-miterlimit="10" d="M172.05,131.719L610.717,17.641
		c0,0,19.386,126.768,88,207.411c77,90.5,192.728,74,192.728,74v1783.667l-791.728-2.333l-54.356-1282
		c0,0,129.689,7,168.856-123.833C276.106,467.815,172.05,131.719,172.05,131.719z"/>
	<path fill="none" stroke="#000000" stroke-width="3" stroke-miterlimit="10" d="M3448.717,2093.849h-1584l4.5-89.296l-51-1200.5
		c0,0,78,7.5,142-70.5c141.641-172.624,11.5-586.5,11.5-586.5l428.667-126.667c0,0,35.333,54.167,255.333,54.167
		c226,0,257-54,257-54l427,126.5c0,0-122.435,393.507,2,571c65.667,93.667,150,85.667,150,85.667l-48,1197.333L3448.717,2093.849z"
		/>
	<path fill="none" stroke="#000000" stroke-width="3" stroke-miterlimit="10" d="M2190.22,2146.053c0,0-0.482,127.06-122,190
		c-195,101-360,22-851,22c-464.954,0-666,62-841.478-34.302c-125.101-68.655-131.522-196.698-131.522-196.698l126-17
		c0,0,6,116,159,131c182.487,17.891,440-20,688-20c248.555,0,498.974,42.392,653,36c200-8.3,192-129,192-129L2190.22,2146.053z"/>
	<path fill="none" stroke="#000000" stroke-width="3" stroke-miterlimit="10" d="M1068.22,4413.053c0,0-225.383-17-390-17
		c-173.616,0-403.997,17-403.997,17l-3.112-65.143L16.908,2835.107c0,0,97.665-20.953,165.312-99.054
		c220-254,327.647-338.924,502.154-338.924c173.008,0,287.846,81.924,497.846,330.924c63.734,75.571,182,93,182,93
		l-290.045,1518.992L1068.22,4413.053z"/>
	
		<rect x="3520.565" y="382.787" fill="none" stroke="#000000" stroke-width="3" stroke-miterlimit="10" width="398.98" height="1429.429"/>
	<path fill="none" stroke="#000000" stroke-width="3" stroke-miterlimit="10" d="M1667.012,132.657L1228.345,18.579
		c0,0-19.386,126.768-88,207.411c-77,90.5-192.729,74-192.729,74v1783.667l791.729-2.333l54.356-1282c0,0-129.69,7-168.856-123.833
		C1562.956,468.752,1667.012,132.657,1667.012,132.657z"/>
	<polygon fill="none" stroke="#000000" stroke-width="3" stroke-miterlimit="10" points="2410.462,2667.051 2653.462,2137.551 
		2690.463,2135.551 2722.462,2175.551 3079.462,2172.551 3078.462,2954.551 2491.462,2953.551 2483.462,2680.551 2411.462,2740.551 
			"/>
	<polygon fill="none" stroke="#000000" stroke-width="3" stroke-miterlimit="10" points="3795.438,2667.051 3552.438,2137.551 
		3515.438,2135.551 3483.438,2175.551 3126.439,2172.551 3127.439,2954.551 3714.438,2953.551 3722.438,2680.551 3794.438,2740.551 
			"/>
	<path fill="none" stroke="#000000" stroke-width="3" stroke-miterlimit="10" d="M3040.791,4320.705
		c0,0-119.376,0.518-199.376,14.518c-93.09,16.291-372.667,66-372.667,66l-42-236c0,0,91-3,115-107
		c27.052-117.223-51.93-605.475-51.93-605.475s144.006,4.207,300.93-1.525c219-8,429,41,386,308
		c-16.355,101.553-51.826,218.544-77.346,320.665C3065.888,4214.003,3040.791,4320.705,3040.791,4320.705z"/>
	<path fill="none" stroke="#000000" stroke-width="3" stroke-miterlimit="10" d="M1464.691,2434.299c0,0,225.383,17,390,17
		c173.616,0,403.997-17,403.997-17l3.112,65.143l254.204,1512.803c0,0-97.665,20.953-165.313,99.054
		c-220,254-327.647,338.924-502.154,338.924c-173.008,0-287.846-81.924-497.846-330.924c-63.734-75.571-182-93-182-93
		l290.045-1518.992L1464.691,2434.299z"/>
	<path fill="none" stroke="#000000" stroke-width="3" stroke-miterlimit="10" d="M3363.898,4320.705
		c0,0,119.376,0.518,199.375,14.518c93.09,16.291,372.666,66,372.666,66l42-236c0,0-91-3-115-107
		c-27.051-117.223,51.93-605.475,51.93-605.475s-144.006,4.207-300.929-1.525c-219-8-429,41-386,308
		c16.355,101.553,51.826,218.544,77.345,320.665C3338.801,4214.003,3363.898,4320.705,3363.898,4320.705z"/>
</g>
<g id="tracés_de_couture">
	<path fill="none" stroke="#00A651" stroke-width="2" stroke-miterlimit="10" d="M990.842,2055.836l720.679-2.124l52.032-1227.193
		c-46.586-6.262-133.754-32.81-166.515-142.244c-26.917-89.917-27.904-211.619-2.932-361.725
		c12.224-73.475,27.686-135.064,36.994-169.119L1249.54,54.204c-10.479,44.813-35.88,129.251-88.257,190.81
		c-60.108,70.646-139.829,83.99-186.971,85.079V1980.99"/>
	
		<line fill="none" stroke="#00A651" stroke-width="2" stroke-miterlimit="10" x1="990.844" y1="2056.819" x2="990.844" y2="329.585"/>
	<path fill="none" stroke="#00A651" stroke-width="2" stroke-miterlimit="10" d="M848.22,2054.899l-720.678-2.124L75.509,825.582
		c46.586-6.262,133.754-32.81,166.515-142.244c26.917-89.917,27.904-211.619,2.932-361.725
		c-12.224-73.475-27.686-135.064-36.994-169.119l381.561-99.228c10.479,44.813,35.88,129.251,88.257,190.81
		c60.108,70.646,139.829,83.99,186.971,85.079v1650.897"/>
	<path fill="none" stroke="#00A651" stroke-width="2" stroke-miterlimit="10" d="M1893.178,2066.158l3.066-60.838l-49.873-1173.958
		c32.935-4.913,87.506-22.009,134.41-79.173c63.821-77.783,85.725-205.399,65.101-379.303
		c-10.553-88.979-29.637-166.472-40.458-205.978L2391.7,52.767c9.139,6.741,22.69,14.499,42.602,21.92
		c51.396,19.156,125.437,28.868,220.066,28.868c97.138,0,172.234-9.691,223.203-28.805c19.329-7.249,32.534-14.911,41.503-21.694
		l384.318,113.855c-10.311,38.041-28.224,111.399-38.815,196.225c-20.877,167.193-3.187,292.299,52.58,371.844
		c49.04,69.951,108.407,90.229,143.781,95.856l-46.947,1171.067l3.462,64.254H1893.178z"/>
	<path fill="none" stroke="#00A651" stroke-width="2" stroke-miterlimit="10" d="M1831.319,2359.761
		c-54.554,0-117.285-4.836-189.922-10.437c-109.57-8.448-245.934-18.963-425.525-18.963c-152.604,0-279.209,6.768-380.938,12.205
		c-74.647,3.99-139.114,7.437-195.852,7.438c-113.018,0.004-185.752-14.612-251.051-50.448
		c-77.583-42.577-97.829-97.781-106.578-134.64l70.043-10.585c3.894,12.675,5.323,16.122,15.929,31.999
		c22.218,33.26,67.609,74.76,157.681,83.59c33.868,3.321,71.469,4.936,114.95,4.936c81.369,0,170.437-5.655,264.734-11.642
		c101.896-6.469,207.261-13.158,311.082-13.158c125.774,0,253.883,11.122,366.912,20.935
		c93.127,8.085,181.091,15.722,252.303,15.722c12.311,0,24.073-0.229,34.96-0.681c84.449-3.505,146.258-26.434,183.71-68.15
		c17.947-19.993,24.899-28.574,29.318-45.143l71.476,10.192c-2.047,10.766-2.498,12.287-8.314,26.908
		c-17.899,44.997-48.987,79.215-92.401,101.7C1987.704,2345.79,1923.237,2359.761,1831.319,2359.761z"/>
	<path fill="none" stroke="#00A651" stroke-width="2" stroke-miterlimit="10" d="M1040.9,4383.451
		c-65.883-4.506-234.448-15.09-364.028-15.09c-136.433,0-309.359,10.557-377.064,15.07l-1.811-37.9l-250.3-1489.573
		c36.288-12.197,103.026-41.145,154.602-100.691c119.447-137.907,195.611-213.232,262.889-259.994
		c69.726-48.464,134.874-69.142,217.839-69.142c83.7,0,149.258,20.111,219.211,67.248
		c69.951,47.136,146.801,122.979,256.966,253.604c50.174,59.493,128.51,86.144,170.61,96.724l-285.115,1493.172L1040.9,4383.451z"/>
	
		<rect x="3547.562" y="411.789" fill="none" stroke="#00A651" stroke-width="2" stroke-miterlimit="10" width="342.287" height="1372.735"/>
	<polygon fill="none" stroke="#00A651" stroke-width="2" stroke-miterlimit="10" points="2517.643,2925.906 2508.741,2622.118 
		2437.649,2681.361 2442.647,2670.218 2672.489,2172.926 2676.086,2165.298 2707.581,2204.667 3034.359,2201.921 3037.198,2926.812 
			"/>
	<path fill="none" stroke="#00A651" stroke-width="2" stroke-miterlimit="10" d="M2458.191,4188.354
		c8.763-2.634,18.716-6.448,29.061-11.972c28.681-15.315,65.975-47.027,80.768-111.131c11.958-51.816,6.812-171.74-15.296-356.438
		c-11.161-93.246-24.013-180.478-31.028-226.345c22.299,0.381,54.267,0.77,92.023,0.77c62.174,0,121.63-1.021,176.716-3.033
		c14.068-0.514,27.881-0.774,41.054-0.774c65.072,0,120.859,6.396,165.813,19.01c50.141,14.069,88.437,36.315,113.825,66.119
		c17.711,20.792,29.895,46.175,36.213,75.445c7.089,32.841,7.114,71.655,0.074,115.366c-11.461,71.165-32.654,150.656-53.15,227.529
		c-8.421,31.585-16.375,61.417-23.71,90.771c-24.432,97.771-44.579,181.765-53.604,219.68c-38.961,0.86-120.61,3.902-181.771,14.605
		c-74.677,13.068-271.625,48.045-344.837,61.054L2458.191,4188.354z"/>
	<path fill="none" stroke="#00A651" stroke-width="2" stroke-miterlimit="10" d="M1492.011,2463.9
		c65.883,4.506,234.448,15.09,364.028,15.09c136.433,0,309.359-10.557,377.064-15.07l1.811,37.9l250.3,1489.573
		c-36.288,12.197-103.026,41.145-154.602,100.691c-119.447,137.907-195.611,213.232-262.889,259.994
		c-69.726,48.464-134.874,69.142-217.839,69.142c-83.7,0-149.258-20.111-219.211-67.248
		c-69.951-47.136-146.801-122.979-256.966-253.604c-50.174-59.493-128.51-86.144-170.61-96.724l285.115-1493.172L1492.011,2463.9z"
		/>
	
		<line fill="none" stroke="#00A651" stroke-width="2" stroke-miterlimit="10" x1="848.217" y1="1911.303" x2="333.22" y2="1911.303"/>
	
		<line fill="none" stroke="#00A651" stroke-width="2" stroke-miterlimit="10" x1="333.22" y1="1911.303" x2="329.72" y2="1602.053"/>
	
		<line fill="none" stroke="#00A651" stroke-width="2" stroke-miterlimit="10" x1="329.72" y1="1602.053" x2="522.72" y2="1192.265"/>
	
		<line fill="none" stroke="#00A651" stroke-width="2" stroke-miterlimit="10" x1="522.72" y1="1192.265" x2="864.75" y2="1192.265"/>
	<polyline fill="none" stroke="#00A651" stroke-width="2" stroke-miterlimit="10" points="891.445,1980.053 863.749,1980.053 
		848.217,1980.053 	"/>
	
		<line fill="none" stroke="#00A651" stroke-width="2" stroke-miterlimit="10" x1="2476.575" y1="4182.856" x2="2510.344" y2="4365.456"/>
	
		<line fill="none" stroke="#00A651" stroke-width="2" stroke-miterlimit="10" x1="848.217" y1="2055.882" x2="848.217" y2="328.648"/>
	<polygon fill="none" stroke="#00A651" stroke-width="2" stroke-miterlimit="10" points="3688.257,2925.91 3697.16,2622.122 
		3768.251,2681.365 3763.253,2670.221 3533.411,2172.93 3529.814,2165.302 3498.32,2204.671 3171.542,2201.925 3168.703,2926.815 	
		"/>
	<path fill="none" stroke="#00A651" stroke-width="2" stroke-miterlimit="10" d="M3946.496,4188.354
		c-8.763-2.634-18.716-6.448-29.061-11.972c-28.681-15.315-65.975-47.027-80.768-111.131
		c-11.958-51.816-6.811-171.74,15.296-356.438c11.161-93.246,24.013-180.478,31.028-226.345c-22.299,0.381-54.266,0.77-92.023,0.77
		c-62.174,0-121.63-1.021-176.716-3.033c-14.068-0.514-27.881-0.774-41.054-0.774c-65.072,0-120.859,6.396-165.812,19.01
		c-50.141,14.069-88.437,36.315-113.825,66.119c-17.711,20.792-29.894,46.175-36.213,75.445
		c-7.089,32.841-7.114,71.655-0.074,115.366c11.461,71.165,32.654,150.656,53.15,227.529c8.421,31.585,16.375,61.417,23.71,90.771
		c24.432,97.771,44.579,181.765,53.604,219.68c38.961,0.86,120.61,3.902,181.77,14.605c74.677,13.068,271.625,48.045,344.836,61.054
		L3946.496,4188.354z"/>
	
		<line fill="none" stroke="#00A651" stroke-width="2" stroke-miterlimit="10" x1="3928.112" y1="4182.856" x2="3894.344" y2="4365.456"/>
	<path fill="none" stroke="#000000" stroke-width="2" stroke-miterlimit="10" d="M976.287,1998.375"/>
	<path fill="none" stroke="#000000" stroke-width="2" stroke-miterlimit="10" d="M990.735,1983.927"/>
	
		<line fill="none" stroke="#00A651" stroke-width="2" stroke-miterlimit="10" x1="990.844" y1="1912.24" x2="1505.841" y2="1912.24"/>
	
		<line fill="none" stroke="#00A651" stroke-width="2" stroke-miterlimit="10" x1="1505.841" y1="1912.24" x2="1509.341" y2="1602.99"/>
	
		<line fill="none" stroke="#00A651" stroke-width="2" stroke-miterlimit="10" x1="1509.341" y1="1602.99" x2="1316.341" y2="1193.202"/>
	
		<line fill="none" stroke="#00A651" stroke-width="2" stroke-miterlimit="10" x1="1316.341" y1="1193.202" x2="974.312" y2="1193.202"/>
	<polyline fill="none" stroke="#00A651" stroke-width="2" stroke-miterlimit="10" points="947.616,1980.99 975.312,1980.99 
		990.844,1980.99 	"/>
</g>
</svg>
