<svg width="512" height="512" viewBox="0 0 512 512" fill="none" xmlns="http://www.w3.org/2000/svg">
<rect width="512" height="512" fill="black" fill-opacity="0"/>
<rect width="512" height="512" fill="#424F7C"/>
<path d="M299.395 367H268.767V260.201H152.288V367H121.819V135.945H152.288V235.286H268.767V135.945H299.395V367ZM386.199 367H355.73V135.945H386.199V367Z" fill="white"/>
</svg>
