digraph "Graphical Class Hierarchy"
{
 // LATEX_PDF_SIZE
  bgcolor="transparent";
  edge [fontname=Helvetica,fontsize=10,labelfontname=Helvetica,labelfontsize=10];
  node [fontname=Helvetica,fontsize=10,shape=box,height=0.2,width=0.4];
  rankdir="LR";
  Node0 [id="Node000000",label="applications.simul.Simul\lModels.SimulModel",height=0.2,width=0.4,color="grey40", fillcolor="white", style="filled",URL="$da/db9/classapplications_1_1simul_1_1_simul_models_1_1_simul_model.html",tooltip=" "];
}
