<svg width="93" height="94" viewBox="0 0 93 94" fill="none" xmlns="http://www.w3.org/2000/svg">
<path fill-rule="evenodd" clip-rule="evenodd" d="M43.207 0.115556C38.5079 0.478666 33.1568 1.70763 29.2973 3.31039C27.4553 4.07534 24.4635 5.5165 23.4339 6.13469C15.6037 10.8367 9.87379 16.7265 5.67795 24.3865C3.24854 28.8216 1.40342 34.2369 0.552592 39.4292C0.0583976 42.4452 -0.12428 46.5482 0.0860595 49.9061C0.381452 54.6225 1.0601 58.0581 2.56398 62.4495C3.59467 65.459 4.27377 67.0272 5.60044 69.4611C9.79702 77.1597 15.6066 83.1864 23.1827 87.7007C24.8776 88.7106 28.7665 90.5317 30.8005 91.2678C36.4737 93.3213 43.6878 94.3377 49.4777 93.8995C58.2374 93.2364 65.6519 90.6749 72.7423 85.8623C74.6647 84.5575 77.6574 82.0882 79.083 80.6301L80.0317 79.6599L79.7662 78.6759C79.4611 77.5452 78.5734 75.6356 77.8888 74.6374C77.1812 73.6056 75.4368 71.8211 74.4369 71.106C69.8103 67.797 62.8667 67.3379 54.3073 69.7751C52.675 70.2398 51.6516 70.6083 46.9975 72.4066C44.6271 73.3226 40.6109 74.6615 38.7141 75.1681C31.3237 77.1423 23.8475 77.3401 18.2405 75.7102C12.4224 74.0187 7.53166 70.3866 3.95248 65.0993L3.3228 64.169L3.65177 63.4848C4.32332 62.0883 5.67765 60.2547 7.06734 58.8605C11.5889 54.3246 17.984 52.1109 25.7713 52.386C31.1743 52.5768 36.1141 53.6786 42.4121 56.0974C45.4315 57.2571 46.0053 57.5056 49.1423 59.0137C51.4365 60.1164 52.0193 60.3566 54.2455 61.1164C57.8692 62.3532 60.4558 62.8497 63.9341 62.9766C71.2197 63.2422 78.331 60.6984 84.8645 55.489C87.2692 53.5716 93 47.5856 93 46.991C93 46.4037 87.216 40.3733 84.8645 38.509C79.5921 34.3293 74.2644 31.9636 68.4011 31.1988C62.2862 30.401 56.3143 31.6092 48.7367 35.1772C43.7387 37.5307 38.2288 39.5734 34.6464 40.401C22.7922 43.1397 13.2241 41.31 7.05921 35.1255C5.67677 33.7386 4.32213 31.9036 3.65177 30.5093L3.3228 29.8251L3.95248 28.8949C7.53195 23.607 12.4199 19.9772 18.2425 18.2831C20.9743 17.4883 22.9296 17.2543 26.8067 17.2583C30.4801 17.262 32.3477 17.4368 35.5339 18.0752C38.7425 18.7181 43.2392 20.1066 47.3673 21.7293C52.548 23.7655 54.2912 24.3316 57.3108 24.9581C64.7222 26.4957 70.3427 25.8165 74.4369 22.8882C75.4368 22.1731 77.1812 20.3886 77.8888 19.3568C78.5734 18.3586 79.4611 16.449 79.7662 15.3182L80.0317 14.3343L79.083 13.3666C75.0712 9.27492 69.1836 5.45462 63.2685 3.10442C57.3714 0.761645 49.6785 -0.384517 43.207 0.115556ZM66.0038 15.0703C67.8146 16.3166 67.6721 19.1851 65.7532 20.1172C63.752 21.089 61.5074 19.6843 61.4967 17.4537C61.4858 15.162 64.1161 13.771 66.0038 15.0703ZM19.3871 28.8876C18.6848 29.055 18.0156 29.496 17.508 30.1261C17.1206 30.6068 17.0444 30.841 16.996 31.6987C16.9339 32.8032 17.1306 33.3737 17.8375 34.1375C18.4422 34.791 19.0202 35.0289 20.0025 35.0289C21.2923 35.0289 22.3652 34.3504 22.8336 33.2387C23.0737 32.669 23.0974 31.3049 22.8774 30.7209C22.4141 29.4907 20.6798 28.5797 19.3871 28.8876ZM80.8349 42.7711C82.1376 43.1591 83.1331 44.7332 82.8647 45.9805C82.5625 47.3842 81.6402 48.2728 80.3228 48.4292C77.3787 48.7791 75.8825 45.2906 78.1282 43.3126C78.4193 43.0561 78.8059 42.8147 78.9874 42.7758C79.4307 42.6812 79.8903 42.5837 79.9933 42.5626C80.0396 42.5531 80.4184 42.6469 80.8349 42.7711ZM19.5587 58.9355C19.4774 58.9659 19.229 59.0309 19.0067 59.08C18.4542 59.2021 17.6074 59.9776 17.2419 60.6963C17.0017 61.1686 16.9512 61.4979 16.9962 62.2971C17.0443 63.1508 17.1215 63.3888 17.5055 63.8681C18.7839 65.4634 20.9463 65.5733 22.3227 64.1127C22.8523 63.5507 23.0348 63.0204 23.0348 62.0443C23.0348 60.3488 22.0131 59.1673 20.3703 58.9628C20.0053 58.9174 19.6401 58.9051 19.5587 58.9355ZM65.7532 73.877C66.7185 74.3458 67.263 75.2737 67.2599 76.4444C67.2568 77.5537 66.8585 78.3312 65.9733 78.9553C65.463 79.3152 65.2 79.394 64.4953 79.3989C62.8098 79.4103 61.6426 78.3453 61.5229 76.6871C61.3583 74.4019 63.6707 72.8657 65.7532 73.877Z" fill="#2275C1"/>
</svg>
