<svg xmlns="http://www.w3.org/2000/svg" width="34.338" height="34.338" viewBox="0 0 34.338 34.338">
  <g id="_001-facebook" data-name="001-facebook" transform="translate(-0.2 -0.041)">
    <path id="Subtração_3" data-name="Subtração 3" d="M-4618.631-1294.621a17.056,17.056,0,0,1-12.14-5.029,17.055,17.055,0,0,1-5.029-12.14,17.055,17.055,0,0,1,5.029-12.14,17.056,17.056,0,0,1,12.14-5.029,17.056,17.056,0,0,1,12.14,5.029,17.055,17.055,0,0,1,5.029,12.14,17.055,17.055,0,0,1-5.029,12.14A17.056,17.056,0,0,1-4618.631-1294.621Zm-2.961-17.157v11.224h4.642v-11.224h3.063l.4-3.941h-3.468v-2.321a.948.948,0,0,1,.984-1.075h2.494v-3.829l-3.437-.015a4.354,4.354,0,0,0-4.683,4.684v2.552h-2.207v3.944Z" transform="translate(4636 1329)" fill="#bacad3"/>
  </g>
</svg>
