<?xml version="1.0" encoding="utf-8"?>
<!-- Generator: Adobe Illustrator 21.0.0, SVG Export Plug-In . SVG Version: 6.00 Build 0)  -->
<svg version="1.1" id="Camada_1" xmlns="http://www.w3.org/2000/svg" xmlns:xlink="http://www.w3.org/1999/xlink" x="0px" y="0px"
	 viewBox="0 0 588 133" style="enable-background:new 0 0 588 133;" xml:space="preserve">
<style type="text/css">
	.st0{fill:#FFFFFF;}
</style>
<g id="Camada_1_1_">
</g>
<g id="grade">
	<g>
		<g>
			<path class="st0" d="M105.8,129.6c-21.7,0-42-11.7-52.8-30.5c-1.7-2.9-0.7-6.7,2.2-8.4c2.9-1.7,6.7-0.7,8.4,2.2
				c8.7,15,24.9,24.4,42.2,24.4c12.5,0,24.4-4.7,33.5-13.3c2.5-2.3,6.3-2.2,8.7,0.2c2.3,2.5,2.2,6.3-0.2,8.7
				C136.3,123.7,121.4,129.6,105.8,129.6z"/>
		</g>
		<path class="st0" d="M26.4,35.4h36.7c3.4,0,6.1,2.7,6.1,6.1l0,0c0,3.4-2.7,6.1-6.1,6.1H26.4c-3.4,0-6.1-2.7-6.1-6.1l0,0
			C20.3,38.2,23,35.4,26.4,35.4z"/>
		<path class="st0" d="M148.5,25c-11.1-10.8-25.6-17-41-17.4c-0.2,0-0.5,0-0.7,0h-1c0,0,0,0,0,0h0H10.7c-3.4,0-6.1,2.7-6.1,6.1
			s2.7,6.1,6.1,6.1h95.1c12.8,0,25,5,34.1,13.9c1.2,1.2,2.7,1.8,4.3,1.8c1.6,0,3.2-0.6,4.4-1.8C150.9,31.3,150.9,27.4,148.5,25z"/>
		<path class="st0" d="M41.8,62.8H57c3.4,0,6.1,2.7,6.1,6.1l0,0c0,3.4-2.7,6.1-6.1,6.1H41.8c-3.4,0-6.1-2.7-6.1-6.1l0,0
			C35.7,65.5,38.4,62.8,41.8,62.8z"/>
		<path class="st0" d="M127.4,72.8c-1.4-2.3-3.7-4.3-6.9-5.9c-3-1.5-7-2.7-12.2-3.9c-3.3-0.7-5.8-1.5-7.5-2.2
			c-1.8-0.8-2.7-1.6-3.1-2.1C97.2,58.1,97,57.2,97,56c0-2,0.7-3.5,2.3-4.7c1.7-1.3,4.2-2,7.2-2c2.5,0,4.5,0.3,6.1,1
			c1.7,0.7,3.6,1.7,5.5,3c2.2,1.6,3.8,2.3,5.2,2.3c1.4,0,2.7-0.6,3.7-1.8c0.9-1.1,1.4-2.4,1.4-4c0-2.7-1.6-5.2-4.7-7.5
			c-2.3-1.6-4.9-2.8-7.8-3.7c-2.9-0.9-5.9-1.3-9-1.3c-4.3,0-8.2,0.8-11.6,2.4c-3.5,1.6-6.3,3.8-8.3,6.7c-2,2.9-3.1,6.2-3.1,10
			c0,4.9,1.7,8.8,5,11.6c3.1,2.7,8,4.8,15,6.3c3.7,0.8,6.6,1.6,8.5,2.4c2.1,0.8,3,1.6,3.4,2.1c0.5,0.6,0.8,1.5,0.8,2.7
			c0,2-0.8,3.4-2.4,4.5c-1.9,1.2-4.7,1.8-8.2,1.8c-3,0-5.5-0.4-7.5-1.1c-2-0.7-4.1-1.8-6.2-3.1c-2.1-1.4-3.7-2-5-2
			c-1.5,0-2.8,0.6-3.8,1.7c-0.9,1.1-1.4,2.4-1.4,3.9c0,1.6,0.4,3,1.2,4.2c0.7,1,1.8,2,3.4,3.1l0.1,0c2.5,1.6,5.5,2.9,8.8,3.8
			c3.3,0.9,6.7,1.3,10.3,1.3c6.9,0,12.6-1.6,16.9-4.8c4.5-3.4,6.8-7.9,6.8-13.4C129.5,78.1,128.8,75.2,127.4,72.8z"/>
		<path class="st0" d="M184,42.4c-1.1-1.2-2.6-1.7-4.4-1.8c0,0,0,0,0,0c-1.8,0-3.3,0.6-4.4,1.7c-1.1,1.1-1.7,2.6-1.7,4.4l-0.1,25.8
			c0,4.3-1.2,7.7-3.7,10.2c-2.4,2.5-5.5,3.7-9.4,3.7c0,0-0.1,0-0.1,0c-3.4,0-5.8-0.9-7.2-2.6c-1.5-1.8-2.3-4.8-2.2-8.9l0.2-28.4
			c0-1.7-0.5-3.2-1.6-4.3c-1.1-1.2-2.6-1.7-4.4-1.8c-1.8,0-3.3,0.6-4.5,1.7c-1.1,1.1-1.7,2.6-1.7,4.4l-0.2,28.6
			c0,7.1,1.6,12.6,5,16.4c3.4,3.8,8.5,5.8,15.1,5.8c0,0,0.1,0,0.1,0c3.9,0,7.5-0.9,10.6-2.6c1.5-0.8,2.9-1.8,4.1-3
			c0.1,1.5,0.6,2.8,1.6,3.8c1.1,1.1,2.5,1.7,4.3,1.7c0,0,0,0,0.1,0c1.8,0,3.3-0.6,4.4-1.7c1.1-1.1,1.6-2.5,1.6-4.2l0.3-44.5
			C185.6,45,185.1,43.6,184,42.4L184,42.4z"/>
		<path class="st0" d="M231.9,44.5L231.9,44.5c-3.7-2.5-8.1-3.7-12.9-3.7c-4.3,0-8.2,0.9-11.4,2.8c-1.5,0.9-2.8,1.9-4,3.1
			c0-1.6-0.6-3-1.6-4.1c-1.1-1.2-2.6-1.7-4.4-1.8c0,0,0,0,0,0c-1.8,0-3.3,0.6-4.4,1.7c-1.1,1.1-1.7,2.6-1.7,4.4l-0.4,63.5
			c0,1.7,0.6,3.1,1.7,4.3c1.1,1.1,2.6,1.7,4.5,1.7c0,0,0,0,0.1,0c1.8,0,3.3-0.5,4.4-1.6c1.1-1.1,1.7-2.5,1.7-4.3l0.1-18.8
			c1.2,1.2,2.5,2.3,4,3.2c3.2,1.9,7.1,2.9,11.4,3c0.1,0,0.1,0,0.2,0c4.8,0,9.1-1.2,12.8-3.5c3.7-2.3,6.6-5.7,8.7-9.9
			c2-4.2,3.1-9.1,3.1-14.7c0-5.6-1-10.6-2.9-14.9C238.5,50.4,235.6,46.9,231.9,44.5z M227.2,82.6c-2.4,2.9-5.7,4.4-10.2,4.3
			c-4.4,0-7.7-1.5-10.1-4.5c-2.4-3.1-3.6-7.6-3.6-13.3c0-5.8,1.3-10.2,3.7-13.2c2.3-2.9,5.6-4.3,10-4.3c0,0,0.1,0,0.1,0
			c4.4,0,7.7,1.5,10.1,4.6c2.4,3.1,3.7,7.6,3.6,13.4C230.9,75.2,229.7,79.6,227.2,82.6L227.2,82.6z"/>
		<path class="st0" d="M297.1,71.5c0.9-1,1.3-2.4,1.3-4.3c0-7.9-2.1-14.3-6.3-19c-4.3-4.8-10-7.2-17.2-7.2c-5,0-9.6,1.2-13.6,3.6
			c-4,2.4-7.1,5.8-9.3,10.1c-2.2,4.3-3.3,9.2-3.3,14.8c0,8.7,2.4,15.7,7.3,20.8c4.9,5.1,11.7,7.7,20.1,7.7c0.1,0,0.1,0,0.2,0
			c2.8,0,5.6-0.4,8.5-1.1c3-0.8,5.8-1.9,8.5-3.5c3.1-1.8,4.6-4,4.6-6.4c0-1.4-0.4-2.7-1.3-3.7c-0.9-1-2.1-1.6-3.4-1.6c0,0,0,0,0,0
			c-0.7,0-1.8,0.2-4.6,1.8c-2.2,1.2-4.2,2.2-6.1,2.8c-1.7,0.6-3.8,1-6.3,1c-0.1,0-0.1,0-0.2,0c-9.3-0.1-14.1-4.7-15.1-14.5l31.9,0.2
			C294.8,73.1,296.2,72.6,297.1,71.5z M261.5,63.7c0.7-3.7,2-6.6,4.1-8.7c2.4-2.4,5.5-3.6,9.5-3.6c3.9,0,6.8,1.2,8.9,3.6
			c1.8,2.1,2.9,5.1,3.3,8.9L261.5,63.7z"/>
		<path class="st0" d="M336,43.2c-1.1-1-2.7-1.5-4.8-1.4l-1.5,0.1c-3.8,0.3-7.2,1.3-10.1,3c-1.3,0.8-2.4,1.7-3.5,2.7
			c0-1.8-0.6-3.2-1.7-4.3c-1.1-1.1-2.5-1.6-4.1-1.6c-1.7,0-3.1,0.5-4.3,1.5c-0.9,0.8-1.9,2.1-1.9,4.5l-0.3,44.4
			c0,1.9,0.6,3.4,1.8,4.5c1.1,1.1,2.6,1.6,4.3,1.6c0,0,0,0,0,0c1.7,0,3.1-0.5,4.3-1.5c1.2-1.1,1.8-2.6,1.8-4.5l0.1-25.6
			c0-3.5,1-6.5,3.1-9.1c2-2.5,5-3.9,9.2-4.2l3.1-0.3c2-0.2,3.5-0.7,4.4-1.8c1-1,1.5-2.3,1.5-3.9C337.5,45.6,337,44.2,336,43.2z"/>
		<path class="st0" d="M365.9,89.7l-2.9-0.2c-2.7-0.2-4.7-1-5.9-2.3c-1.3-1.4-1.9-3.8-1.9-7.2V54.8h9.9c1.6,0,2.9-0.5,3.9-1.4
			c1.1-0.9,1.6-2.2,1.6-3.8c0-1.6-0.5-2.9-1.6-3.9c-1-1-2.4-1.5-4-1.5h-9.9V34.2c0-1.9-0.6-3.4-1.7-4.5c-1.1-1.1-2.6-1.6-4.3-1.6
			c-1.8,0-3.3,0.5-4.5,1.6c-1.2,1.1-1.7,2.6-1.7,4.5v10.1v10.5v24.7c0,6.4,1.5,11.4,4.5,14.7c3,3.3,7.6,5.2,13.7,5.7l2.8,0.2
			c0.4,0,0.8,0,1.1,0c1.7,0,3-0.3,4-1c1-0.7,2.1-1.9,2.1-4.2C371.4,93.5,370.8,90.1,365.9,89.7z"/>
		<path class="st0" d="M388.4,49.4c0-1.9-0.6-3.4-1.7-4.5c-1.1-1.1-2.6-1.6-4.3-1.6c-1.7,0-3.2,0.5-4.4,1.6
			c-1.2,1.1-1.8,2.6-1.8,4.5v44.7c0,1.9,0.6,3.4,1.8,4.5c1.2,1.1,2.6,1.6,4.4,1.6c1.7,0,3.2-0.5,4.3-1.5c1.2-1.1,1.8-2.6,1.8-4.5
			L388.4,49.4L388.4,49.4z"/>
		<path class="st0" d="M436.1,83.8c-0.8,0-1.7,0.2-2.6,0.7c-0.8,0.4-1.6,0.8-2.4,1.4l0,0c-1.7,1.1-3.3,2-4.9,2.7
			c-1.5,0.6-3.3,0.9-5.5,0.9c-4.6,0-8.1-1.4-10.6-4.4c-2.6-3-3.9-7.5-3.9-13.2c0-5.7,1.3-10.2,3.9-13.4c2.5-3.1,6-4.6,10.6-4.6
			c2.1,0,3.9,0.3,5.4,0.9c1.6,0.7,3.2,1.6,5,2.7l0.2,0.1c0,0,0.1,0.1,0.6,0.4c0.5,0.3,1,0.7,1.7,1c0.8,0.4,1.6,0.6,2.4,0.6
			c1.4,0,2.6-0.6,3.5-1.6c0.8-1,1.2-2.2,1.2-3.6c0-1.3-0.4-2.6-1.1-3.7c-0.7-1-1.7-2-3.2-3c-2.1-1.5-4.7-2.7-7.5-3.5
			c-2.8-0.8-5.7-1.2-8.5-1.2c-5.2,0-9.9,1.2-13.9,3.7c-4,2.4-7.2,5.9-9.4,10.3c-2.2,4.3-3.3,9.4-3.3,14.9c0,5.6,1.1,10.5,3.2,14.8
			c2.2,4.3,5.3,7.7,9.3,10.1c4,2.3,8.6,3.5,13.7,3.5c3,0,6-0.4,8.9-1.3c3-0.9,5.5-2,7.7-3.5c1.6-1.1,2.6-2,3.2-3
			c0.7-1,1.1-2.2,1.1-3.5c0-1.4-0.4-2.6-1.2-3.6C438.5,84.4,437.4,83.8,436.1,83.8z"/>
		<path class="st0" d="M490.6,89.6l-21.3-18.6l19.3-17.3c1.4-1.3,2.1-2.8,2.1-4.5c0-1.5-0.6-2.9-1.7-4.1c-1.1-1.1-2.5-1.7-4.1-1.7
			c-1.5,0-2.9,0.6-4.1,1.8l-22.2,20.3V48.9c0-2.3-1-3.7-1.8-4.5c-1.2-1.1-2.6-1.6-4.3-1.6c-1.7,0-3.2,0.5-4.4,1.6
			c-1.2,1.1-1.8,2.6-1.8,4.5v45.2c0,1.9,0.6,3.4,1.8,4.5c1.2,1.1,2.6,1.6,4.4,1.6c1.7,0,3.1-0.5,4.3-1.6c1.2-1.1,1.8-2.6,1.8-4.5
			V77.2l24.6,21.2c1.3,1.1,2.7,1.7,4.1,1.7c1.6,0,3-0.6,4-1.7c1.1-1.1,1.6-2.5,1.6-4C492.9,92.7,492.1,91.1,490.6,89.6z"/>
		<path class="st0" d="M543.5,85.5c-0.9-1-2.1-1.6-3.4-1.6c-0.7,0-1.8,0.2-4.6,1.8c-2.2,1.2-4.2,2.2-6.1,2.9c-1.8,0.7-3.9,1-6.4,1
			c-9.3,0-14.2-4.6-15.3-14.5h32.1c1.8,0,3.2-0.5,4.1-1.6c0.9-1,1.3-2.4,1.3-4.3c0-7.9-2.2-14.3-6.4-19c-4.3-4.8-10.1-7.2-17.4-7.2
			c-5.1,0-9.6,1.2-13.6,3.7c-4,2.4-7.1,5.9-9.3,10.2c-2.2,4.3-3.3,9.3-3.3,14.9c0,8.8,2.5,15.8,7.5,20.9c5,5.1,11.8,7.6,20.2,7.6
			c2.8,0,5.8-0.4,8.7-1.2c3-0.8,5.8-2,8.5-3.5c3.1-1.8,4.6-4,4.6-6.5C544.8,87.7,544.3,86.5,543.5,85.5L543.5,85.5z M508,66
			c0.6-3.7,2-6.7,4-8.8c2.4-2.5,5.5-3.7,9.5-3.7c3.9,0,6.9,1.2,9,3.6c1.9,2.1,3,5.1,3.3,8.9H508z"/>
		<path class="st0" d="M579.6,89.7l-2.9-0.2c-2.7-0.2-4.7-1-5.9-2.3c-1.3-1.4-1.9-3.8-1.9-7.2V54.8h9.9c1.6,0,2.9-0.5,3.9-1.4
			c1.1-0.9,1.6-2.2,1.6-3.8c0-1.6-0.5-2.9-1.6-3.9c-1-1-2.4-1.5-4-1.5h-9.9V34.2c0-1.9-0.6-3.4-1.7-4.5c-1.1-1.1-2.6-1.6-4.3-1.6
			c-1.8,0-3.3,0.5-4.5,1.6c-1.2,1.1-1.7,2.6-1.7,4.5v10.1h-5.2c-1.7,0-3.1,0.5-4.1,1.5c-1,1-1.6,2.3-1.6,3.9c0,1.5,0.6,2.8,1.6,3.8
			c1,0.9,2.4,1.4,4,1.4h5.2v24.7c0,6.4,1.5,11.4,4.5,14.7c3,3.3,7.6,5.2,13.7,5.7l2.8,0.2c0.4,0,0.8,0,1.1,0c1.7,0,3-0.3,4-1
			c1-0.7,2.1-1.9,2.1-4.2C585,93.5,584.5,90.1,579.6,89.7z"/>
	</g>
</g>
</svg>
