<?xml version="1.0" encoding="utf-8"?>
<!-- Generator: Adobe Illustrator 21.0.0, SVG Export Plug-In . SVG Version: 6.00 Build 0)  -->
<svg version="1.1" id="Calque_1" xmlns="http://www.w3.org/2000/svg" xmlns:xlink="http://www.w3.org/1999/xlink" x="0px" y="0px"
	 viewBox="0 0 512 512" style="enable-background:new 0 0 512 512;" xml:space="preserve">
<style type="text/css">
	.st0{fill:#563D7C;}
	.st1{fill:#E6E6E6;}
	.st2{fill:#FF6536;}
	.st3{fill:#FDB62F;}
	.st4{fill:#02998A;}
</style>
<g id="Filled_Outline">
	<path class="st0" d="M56,132h400c8.8,0,16,7.2,16,16v288l0,0H40l0,0V148C40,139.2,47.2,132,56,132z"/>
	<rect x="72" y="164" class="st1" width="368" height="240"/>
	<path class="st0" d="M24,436h464v16c0,8.8-7.2,16-16,16H40c-8.8,0-16-7.2-16-16V436z"/>
	<polygon class="st2" points="256,284 208,340 232,340 232,372 280,372 280,340 304,340 	"/>
	<circle class="st3" cx="256" cy="124" r="120"/>
	<path class="st4" d="M373,150.3c0.1-0.3,0.2-0.6,0.2-0.8c0.8-3.5,1.3-7.2,1.8-10.8c0.1-0.6,0.2-1.2,0.3-1.9
		c0.5-4.3,0.7-8.5,0.7-12.8c0-4.5-0.3-9-0.8-13.5c-0.2-1.3-0.4-2.6-0.6-3.9c-0.5-3.1-1-6.2-1.7-9.2c-0.3-1.4-0.7-2.8-1.1-4.1
		c-0.8-3-1.7-5.9-2.7-8.8c-0.4-1.2-0.8-2.4-1.3-3.5c-1.2-3.2-2.6-6.3-4.1-9.4c-0.4-0.7-0.7-1.5-1-2.2c-8.2-15.9-19.8-29.8-34-40.6
		l0,0l-8.6,6.1c-13.7,9.8-17.7,28.3-9.4,42.9l4.9,8.6c7.3,12.8,5.2,29-5.3,39.4c-12.8,12.8-12.8,33.5,0,46.3
		c2.1,2.1,4.4,3.8,6.9,5.3l3.6,2c9.5,5.4,21.1,5.8,30.9,0.9l13.6-6.8l0,0C368.6,166,371.2,158.2,373,150.3z"/>
	<path class="st4" d="M258.3,187.2c-20.8-9.3-34.3-29.9-34.3-52.7c0-12-3.8-23.8-10.8-33.5l-3.8-5.3C195.3,76,170.3,67.3,147,73.8
		l0,0c-1.8,3.8-3.3,7.7-4.7,11.7l-0.1,0.2c-1.3,3.8-2.3,7.6-3.2,11.4c-0.1,0.4-0.2,0.7-0.3,1.1c-0.8,3.5-1.4,7.2-1.8,10.8
		c-0.1,0.7-0.2,1.4-0.3,2.1c-0.5,4.3-0.7,8.6-0.7,13c0,66.3,53.7,120,120,120c3.9,0,7.7-0.2,11.4-0.6c2.6-0.3,5.1-0.7,7.6-1.1
		c1-0.2,2.1-0.3,3.1-0.5c3.3-0.6,6.5-1.4,9.7-2.3l0.5-0.1c3.4-0.9,6.7-2,9.9-3.3C293.5,214.4,278.6,196.3,258.3,187.2z"/>
</g>
</svg>
