-r base.txt

Werkzeug==2.0.2 # https://github.com/pallets/werkzeug
ipdb==0.13.9  # https://github.com/gotcha/ipdb
psycopg2==2.9.1  # https://github.com/psycopg/psycopg2

# Testing
# ------------------------------------------------------------------------------
mypy==0.910  # https://github.com/python/mypy
django-stubs==1.8.0  # https://github.com/typeddjango/django-stubs
pytest==6.2.5  # https://github.com/pytest-dev/pytest
pytest-sugar==0.9.4  # https://github.com/Frozenball/pytest-sugar
djangorestframework-stubs==1.4.0  # https://github.com/typeddjango/djangorestframework-stubs



# Code quality
# ------------------------------------------------------------------------------
flake8==4.0.1  # https://github.com/PyCQA/flake8
flake8-isort==4.1.1  # https://github.com/gforcada/flake8-isort
coverage==6.0.2  # https://github.com/nedbat/coveragepy
black==21.9b0  # https://github.com/psf/black
pylint-django==2.4.4  # https://github.com/PyCQA/pylint-django
pre-commit==2.15.0  # https://github.com/pre-commit/pre-commit

# Django
# ------------------------------------------------------------------------------
factory-boy==3.2.0  # https://github.com/FactoryBoy/factory_boy

django-debug-toolbar==3.2.2  # https://github.com/jazzband/django-debug-toolbar
django-coverage-plugin==2.0.1  # https://github.com/nedbat/django_coverage_plugin
pytest-django==4.4.0  # https://github.com/pytest-dev/pytest-django

# UML 
pygraphviz #https://github.com/pygraphviz/pygraphviz
