<svg width="36" height="50" viewBox="0 0 36 50" fill="none" xmlns="http://www.w3.org/2000/svg">
<path d="M32.3558 3.82883H22.0859V5.96847C22.0872 6.17786 22.0061 6.37933 21.8607 6.52713C21.7158 6.67538 21.5182 6.75808 21.3129 6.75676H14.6871C14.4818 6.75808 14.2842 6.67538 14.1393 6.52713C13.9939 6.37933 13.9128 6.17786 13.9141 5.96847V3.82883H3.64417C1.63229 3.83103 0.0021568 5.49338 0 7.54504V46.2838C0.0021568 48.3354 1.63229 49.9978 3.64417 50H32.3558C34.3677 49.9978 35.9978 48.3354 36 46.2838V7.54504C35.9978 5.49338 34.3677 3.83103 32.3558 3.82883ZM18 11.7117C20.9699 11.7117 23.3778 14.1672 23.3778 17.1959C23.3778 20.225 20.9699 22.68 18 22.68C15.0301 22.68 12.6222 20.225 12.6222 17.1959C12.6256 14.1685 15.0313 11.7152 18 11.7117ZM12.0256 28.0405C13.6035 26.4121 15.7552 25.4953 18 25.4953C20.2448 25.4953 22.3965 26.4121 23.9744 28.0405C25.5644 29.6959 26.4366 31.9595 26.4366 34.4146C26.4379 34.624 26.3573 34.825 26.2119 34.9733C26.0665 35.1215 25.8694 35.2042 25.6636 35.2029H10.3364C10.1306 35.2042 9.93347 35.1215 9.7881 34.9733C9.64273 34.825 9.56207 34.624 9.56336 34.4146C9.56336 31.9595 10.4356 29.6959 12.0256 28.0405ZM25.1999 39.7523C25.2012 39.9616 25.1201 40.1631 24.9752 40.3109C24.8298 40.4592 24.6322 40.5419 24.4269 40.5405H11.5731C11.146 40.5405 10.8001 40.1877 10.8001 39.7523C10.8001 39.3168 11.146 38.964 11.5731 38.964H24.4381C24.6417 38.9648 24.8367 39.0489 24.9795 39.1967C25.1227 39.3445 25.2021 39.5446 25.1999 39.7523ZM29.9484 45.4955H6.05162C5.62457 45.4955 5.27861 45.1427 5.27861 44.7072C5.27861 44.2717 5.62457 43.9189 6.05162 43.9189H29.9596C30.1649 43.9176 30.3621 44.0003 30.5074 44.1485C30.6528 44.2963 30.7339 44.4978 30.7326 44.7072C30.7313 44.9179 30.6481 45.1194 30.501 45.2672C30.3539 45.415 30.155 45.4973 29.9484 45.4955Z" fill="#5983F7"/>
<path d="M18.6134 13.3384C20.7025 13.6842 22.1213 15.6914 21.7822 17.8214C21.4432 19.9518 19.4748 21.3986 17.3862 21.0528C15.2971 20.7071 13.8783 18.6999 14.2174 16.5699C14.5564 14.4395 16.5247 12.9927 18.6134 13.3384Z" fill="#5983F7"/>
<path d="M15.4601 0H20.5399V5.18018H15.4601V0Z" fill="#5983F7"/>
<path d="M22.8701 29.1442C21.5829 27.818 19.8294 27.0719 18 27.0719C16.1706 27.0719 14.4171 27.818 13.1299 29.1442C11.9928 30.3267 11.3078 31.9032 11.1422 33.6263H24.8578C24.6922 31.8918 24.0072 30.3267 22.8701 29.1442Z" fill="#5983F7"/>
</svg>
