<svg width="345" height="360" viewBox="0 0 345 360" fill="none" xmlns="http://www.w3.org/2000/svg">
<path d="M344.5 190C344.5 283.612 268.612 359.5 175 359.5C81.3877 359.5 5.5 283.612 5.5 190C5.5 96.3877 81.3877 20.5 175 20.5C268.612 20.5 344.5 96.3877 344.5 190Z" stroke="#D23E87"/>
<path d="M324.5 190.5C324.5 272.79 257.79 339.5 175.5 339.5C93.2096 339.5 26.5 272.79 26.5 190.5C26.5 108.21 93.2096 41.5 175.5 41.5C257.79 41.5 324.5 108.21 324.5 190.5Z" stroke="white"/>
<path opacity="0.5" d="M100.5 65.5C100.5 93.1142 78.1142 115.5 50.5 115.5C22.8858 115.5 0.5 93.1142 0.5 65.5C0.5 37.8858 22.8858 15.5 50.5 15.5C78.1142 15.5 100.5 37.8858 100.5 65.5Z" fill="#FCFAFC" stroke="#D23E87"/>
<path opacity="0.2" d="M80.5 15.5C80.5 23.7843 73.7843 30.5 65.5 30.5C57.2157 30.5 50.5 23.7843 50.5 15.5C50.5 7.21573 57.2157 0.5 65.5 0.5C73.7843 0.5 80.5 7.21573 80.5 15.5Z" stroke="#D23E87"/>
<path fill-rule="evenodd" clip-rule="evenodd" d="M187.608 235.31H121.273V222.69C121.273 221.205 120.066 220 118.577 220C117.088 220 115.88 221.205 115.88 222.69V235.954C115.88 238.565 118.01 240.69 120.628 240.69H136.729V257.593C136.729 257.842 136.526 258.044 136.276 258.044H122.836V255.381C122.836 252.11 120.169 249.448 116.89 249.448H106.158C102.879 249.448 100.211 252.11 100.211 255.381V266.088C100.211 269.359 102.879 272.021 106.158 272.021H116.89C120.169 272.021 122.836 269.36 122.836 266.088V263.425H136.276C139.499 263.425 142.121 260.808 142.121 257.593V240.69H172.081V259.069H169.412C166.132 259.069 163.465 261.73 163.465 265.002V275.708C163.465 278.98 166.132 281.642 169.412 281.642H180.143C183.422 281.642 186.09 278.98 186.09 275.708V265.002C186.09 261.731 183.422 259.069 180.143 259.069H177.473V240.69H187.608C189.097 240.69 190.305 239.485 190.305 238C190.305 236.514 189.097 235.31 187.608 235.31ZM117.444 266.088C117.444 266.393 117.195 266.641 116.89 266.641H106.158C105.853 266.641 105.604 266.393 105.604 266.088V255.381C105.604 255.076 105.852 254.828 106.158 254.828H116.89C117.195 254.828 117.444 255.076 117.444 255.381V266.088ZM180.697 265.002C180.697 264.697 180.448 264.449 180.142 264.449H169.411C169.105 264.449 168.857 264.697 168.857 265.002V275.708C168.857 276.014 169.106 276.262 169.411 276.262H180.142C180.448 276.262 180.697 276.013 180.697 275.708V265.002Z" fill="#615F60"/>
<path fill-rule="evenodd" clip-rule="evenodd" d="M187.942 147.716H133.652C132.163 147.716 130.956 148.92 130.956 150.406C130.956 151.892 132.163 153.096 133.652 153.096H187.942C189.432 153.096 190.639 151.892 190.639 150.406C190.639 148.92 189.432 147.716 187.942 147.716Z" fill="#D23E87"/>
<path fill-rule="evenodd" clip-rule="evenodd" d="M199.35 147.256C197.861 147.256 196.654 148.461 196.654 149.946V150.24C196.654 151.726 197.861 152.93 199.35 152.93C200.839 152.93 202.046 151.726 202.046 150.24V149.946C202.046 148.461 200.839 147.256 199.35 147.256Z" fill="#D23E87"/>
<path fill-rule="evenodd" clip-rule="evenodd" d="M207.625 147.256C206.136 147.256 204.929 148.461 204.929 149.946V150.24C204.929 151.726 206.136 152.93 207.625 152.93C209.114 152.93 210.321 151.726 210.321 150.24V149.946C210.321 148.461 209.114 147.256 207.625 147.256Z" fill="#D23E87"/>
<path fill-rule="evenodd" clip-rule="evenodd" d="M215.9 147.256C214.411 147.256 213.204 148.461 213.204 149.946V150.24C213.204 151.726 214.411 152.93 215.9 152.93C217.389 152.93 218.596 151.726 218.596 150.24V149.946C218.596 148.461 217.389 147.256 215.9 147.256Z" fill="#D23E87"/>
<path fill-rule="evenodd" clip-rule="evenodd" d="M243.396 107.62H232.665C229.386 107.62 226.718 110.282 226.718 113.554V116.217H213.278C210.055 116.217 207.433 118.833 207.433 122.048V138.952H177.473V120.572H180.143C183.422 120.572 186.09 117.911 186.09 114.639V103.933C186.089 100.661 183.422 98 180.143 98H169.412C166.132 98 163.465 100.661 163.465 103.933V114.64C163.465 117.911 166.132 120.573 169.412 120.573H172.081V138.953H142.121V122.048C142.121 118.833 139.499 116.217 136.276 116.217H122.836V113.554C122.836 110.282 120.169 107.62 116.89 107.62H106.158C102.879 107.62 100.211 110.282 100.211 113.554V124.26C100.211 127.531 102.879 130.193 106.158 130.193H116.89C120.169 130.193 122.836 127.532 122.836 124.26V121.597H136.276C136.526 121.597 136.729 121.799 136.729 122.048V138.952H123.063C119.103 138.952 115.88 142.167 115.88 146.118V211.708C115.88 213.194 117.088 214.398 118.577 214.398C120.066 214.398 121.273 213.194 121.273 211.708V161.235H228.279V172.015C228.279 173.501 229.487 174.705 230.976 174.705C232.465 174.705 233.672 173.501 233.672 172.015V146.118C233.672 142.167 230.45 138.952 226.489 138.952H212.825V122.048C212.825 121.799 213.029 121.597 213.278 121.597H226.718V124.26C226.718 127.531 229.386 130.193 232.665 130.193H243.396C246.675 130.193 249.343 127.532 249.343 124.26V113.554C249.343 110.282 246.675 107.62 243.396 107.62ZM117.444 124.26C117.444 124.565 117.195 124.813 116.89 124.813H106.158C105.853 124.813 105.604 124.565 105.604 124.26V113.553C105.604 113.248 105.852 113 106.158 113H116.89C117.195 113 117.444 113.248 117.444 113.553V124.26ZM168.858 114.639C168.858 114.944 169.106 115.192 169.412 115.192H180.143C180.449 115.192 180.697 114.944 180.697 114.639V103.933C180.697 103.628 180.449 103.38 180.143 103.38H169.412C169.106 103.38 168.858 103.628 168.858 103.933V114.639ZM226.489 144.332C227.476 144.332 228.279 145.134 228.279 146.118V155.855H121.273V146.118C121.273 145.133 122.076 144.332 123.063 144.332H226.489ZM243.396 124.813C243.702 124.813 243.95 124.565 243.95 124.26V113.553C243.95 113.248 243.701 113 243.396 113H232.665C232.359 113 232.111 113.248 232.111 113.553V124.26C232.111 124.565 232.359 124.813 232.665 124.813H243.396Z" fill="#615F60"/>
<path fill-rule="evenodd" clip-rule="evenodd" d="M232.665 249.448H243.396C246.675 249.448 249.343 252.11 249.343 255.382V266.088C249.343 269.36 246.675 272.021 243.396 272.021H232.665C229.386 272.021 226.718 269.36 226.718 266.088V263.425H213.278C210.055 263.425 207.433 260.809 207.433 257.593V240.69H198.616C197.127 240.69 195.92 239.486 195.92 238C195.92 236.514 197.127 235.31 198.616 235.31H228.28V182.997C228.28 181.512 229.487 180.307 230.976 180.307C232.466 180.307 233.673 181.512 233.673 182.997V235.954C233.673 238.566 231.543 240.69 228.926 240.69H212.826V257.593C212.826 257.842 213.029 258.045 213.278 258.045H226.718V255.382C226.718 252.11 229.386 249.448 232.665 249.448ZM243.396 266.641C243.702 266.641 243.95 266.393 243.95 266.088V255.381C243.95 255.076 243.702 254.828 243.396 254.828H232.665C232.359 254.828 232.111 255.076 232.111 255.381V266.088C232.111 266.393 232.359 266.641 232.665 266.641H243.396Z" fill="#615F60"/>
<path fill-rule="evenodd" clip-rule="evenodd" d="M178.855 207.191C176.936 207.191 175.376 208.703 175.376 210.561C175.376 212.42 176.936 213.931 178.855 213.931C180.772 213.931 182.332 212.42 182.332 210.561C182.332 208.703 180.772 207.191 178.855 207.191Z" fill="#D23E87"/>
<path fill-rule="evenodd" clip-rule="evenodd" d="M192.355 187.024C192.536 186.156 192.271 185.251 191.646 184.605C188.256 181.103 183.447 179.094 178.453 179.093C174.526 179.111 170.609 180.517 167.426 183.052L166.359 183.903V181.9C166.359 180.353 165.06 179.093 163.462 179.093C161.864 179.093 160.564 180.353 160.564 181.9V211.123C160.564 212.672 161.864 213.931 163.462 213.931C165.06 213.931 166.359 212.672 166.359 211.123L166.375 196.275C166.372 196.119 166.371 196.023 166.375 195.926C166.682 189.846 171.841 184.923 178.12 184.718C181.661 184.603 185.023 185.975 187.422 188.462C188.224 189.293 189.501 189.532 190.603 189.054C191.56 188.641 192.174 187.9 192.355 187.024Z" fill="#D23E87"/>
</svg>
