<svg width="18" height="19" viewBox="0 0 18 19" fill="none" xmlns="http://www.w3.org/2000/svg">
<path d="M3.28941 2.17249L3.99296 1.46183L3.28231 0.75829L2.57876 1.46894L3.28941 2.17249ZM4.00006 2.87603L4.70361 2.16538L4.00006 2.87603ZM1.88232 3.59379L1.17167 2.89024L0.468128 3.60089L1.17878 4.30444L1.88232 3.59379ZM2.59298 4.29733L3.29652 3.58668L3.29652 3.58668L2.59298 4.29733ZM7.94922 9.60001L8.65276 10.3107L9.37059 9.60001L8.65276 8.88936L7.94922 9.60001ZM2.59298 14.9027L3.29652 15.6133L2.59298 14.9027ZM1.88232 15.6062L1.17878 14.8956L0.468128 15.5991L1.17167 16.3098L1.88232 15.6062ZM3.28941 17.0275L2.57876 17.7311L3.28231 18.4417L3.99296 17.7382L3.28941 17.0275ZM4.00006 16.324L3.29652 15.6133L4.00006 16.324ZM9.37059 11.0072L10.0741 10.2965L9.37059 9.60001L8.66705 10.2965L9.37059 11.0072ZM14.2967 15.884L13.5931 16.5947L14.2967 15.884ZM15.0073 16.5875L14.3038 17.2982L15.0144 18.0017L15.718 17.2911L15.0073 16.5875ZM16.4144 15.1662L17.1251 15.8698L17.8286 15.1591L17.118 14.4556L16.4144 15.1662ZM15.7038 14.4627L15.0002 15.1733L15.7038 14.4627ZM10.792 9.60001L10.0884 8.88936L9.37059 9.60001L10.0884 10.3107L10.792 9.60001ZM15.7038 4.73733L15.0002 4.02668V4.02668L15.7038 4.73733ZM16.4144 4.03379L17.118 4.74444L17.8286 4.04089L17.1251 3.33024L16.4144 4.03379ZM15.0073 2.61249L15.718 1.90894L15.0144 1.19829L14.3038 1.90183L15.0073 2.61249ZM14.2967 3.31603L13.5931 2.60538V2.60538L14.2967 3.31603ZM9.37059 8.19285L8.66705 8.90351L9.37059 9.60001L10.0741 8.90351L9.37059 8.19285ZM2.58587 2.88314L3.29652 3.58668L4.70361 2.16538L3.99296 1.46183L2.58587 2.88314ZM2.59298 4.29733L4.00006 2.87603L2.57876 1.46894L1.17167 2.89024L2.59298 4.29733ZM3.29652 3.58668L2.58587 2.88314L1.17878 4.30444L1.88943 5.00798L3.29652 3.58668ZM8.65276 8.88936L3.29652 3.58668L1.88943 5.00798L7.24568 10.3107L8.65276 8.88936ZM7.24568 8.88936L1.88943 14.192L3.29652 15.6133L8.65276 10.3107L7.24568 8.88936ZM1.88943 14.192L1.17878 14.8956L2.58587 16.3169L3.29652 15.6133L1.88943 14.192ZM1.17167 16.3098L2.57876 17.7311L4.00006 16.324L2.59298 14.9027L1.17167 16.3098ZM3.99296 17.7382L4.70361 17.0346L3.29652 15.6133L2.58587 16.3169L3.99296 17.7382ZM4.70361 17.0346L10.0741 11.7178L8.66705 10.2965L3.29652 15.6133L4.70361 17.0346ZM15.0002 15.1733L10.0741 10.2965L8.66705 11.7178L13.5931 16.5947L15.0002 15.1733ZM15.7109 15.8769L15.0002 15.1733L13.5931 16.5947L14.3038 17.2982L15.7109 15.8769ZM15.7038 14.4627L14.2967 15.884L15.718 17.2911L17.1251 15.8698L15.7038 14.4627ZM15.0002 15.1733L15.7109 15.8769L17.118 14.4556L16.4073 13.752L15.0002 15.1733ZM10.0884 10.3107L15.0002 15.1733L16.4073 13.752L11.4955 8.88936L10.0884 10.3107ZM11.4955 10.3107L16.4073 5.44798L15.0002 4.02668L10.0884 8.88936L11.4955 10.3107ZM16.4073 5.44798L17.118 4.74444L15.7109 3.32314L15.0002 4.02668L16.4073 5.44798ZM17.1251 3.33024L15.718 1.90894L14.2967 3.31603L15.7038 4.73733L17.1251 3.33024ZM14.3038 1.90183L13.5931 2.60538L15.0002 4.02668L15.7109 3.32314L14.3038 1.90183ZM13.5931 2.60538L8.66705 7.4822L10.0741 8.90351L15.0002 4.02668L13.5931 2.60538ZM3.29652 3.58668L8.66705 8.90351L10.0741 7.4822L4.70361 2.16538L3.29652 3.58668Z" fill="white"/>
</svg>
