<svg width="14" height="10" viewBox="0 0 14 10" fill="none" xmlns="http://www.w3.org/2000/svg">
<path fill-rule="evenodd" clip-rule="evenodd" d="M2.32951 3.55053C2.22392 3.44542 2.08834 3.39285 1.9225 3.39285C1.75646 3.39285 1.62461 3.44561 1.52662 3.55053L0.158313 4.81091C0.0527182 4.90903 0 5.03151 0 5.1786C0 5.32566 0.052837 5.45188 0.158313 5.55689L4.76089 9.84239C4.85136 9.9265 4.9644 9.97561 5.1001 9.98972C5.11527 9.99672 5.13792 10 5.16798 10C5.31869 10 5.45807 9.94733 5.58641 9.84239L13.8414 2.17444C13.9472 2.06926 14 1.94329 14 1.79616C14 1.64911 13.9472 1.52303 13.8414 1.41807L12.4846 0.157502C12.3716 0.052427 12.2357 0 12.0774 0C11.9191 0 11.7833 0.0525742 11.6702 0.157502L5.17928 6.19744L2.32951 3.55053Z" fill="white"/>
</svg>
