Division,WeightClassKg,Place,Name,Team,BodyweightKg,Best3SquatKg,Best3BenchKg,Best3DeadliftKg,TotalKg,Equipment,Event,Sex,BirthDate
Boys,51.71,1,Gonzalo Ortiz,Dublin,47.26,122.47,79.38,131.54,333.39,Unlimited,SBD,M,
Boys,51.71,2,Luke Barr,Hico,51.35,124.74,77.11,122.47,324.32,Unlimited,SBD,M,
Boys,55.79,1,Jaxon McGavock,Hico,53.34,120.2,70.31,136.08,326.59,Unlimited,SBD,M,
Boys,55.79,2,Kason McGinn,Rising Star,55.34,106.59,56.7,136.08,299.37,Unlimited,SBD,M,
Boys,55.79,DQ,Chance Wells,Rising Star,54.43,97.52,,,,Unlimited,SBD,M,
Boys,55.79,DQ,Axel Rangel,Comanche,55.61,,,,,Unlimited,SBD,M,
Boys,55.79,DQ,Brylen Feist,Tolar,55.52,,,,,Unlimited,SBD,M,
Boys,59.87,1,Cameron Patton,Dublin,59.15,192.78,133.81,179.17,505.76,Unlimited,SBD,M,
Boys,59.87,2,Andrew Colclasure,Comanche,58.15,161.03,86.18,161.03,408.23,Unlimited,SBD,M,
Boys,59.87,3,Payton McGinn,Rising Star,58.51,115.67,86.18,136.08,337.93,Unlimited,SBD,M,
Boys,59.87,4,Dexter Barron,Tolar,58.42,74.84,63.5,124.74,263.08,Unlimited,SBD,M,
Boys,59.87,DQ,Pacey McGinn,Rising Star,57.61,120.2,95.25,,,Unlimited,SBD,M,
Boys,59.87,DQ,Adam Perez,De Leon,58.88,145.15,88.45,,,Unlimited,SBD,M,
Boys,67.13,1,Cosme Gonzalez,Comanche,66.59,217.72,149.69,226.8,594.21,Unlimited,SBD,M,
Boys,67.13,2,Marshall Daniel,Dublin,66.22,183.7,108.86,183.7,476.27,Unlimited,SBD,M,
Boys,67.13,3,Darren Odell,Comanche,65.32,161.03,97.52,170.1,428.64,Unlimited,SBD,M,
Boys,67.13,4,Eduardo Garcia,De Leon,62.23,124.74,77.11,158.76,360.61,Unlimited,SBD,M,
Boys,67.13,5,Cooper Clemons,Tolar,64.55,124.74,74.84,127.01,326.59,Unlimited,SBD,M,
Boys,67.13,6,Lelland Schenk,Rising Star,65.77,106.59,68.04,133.81,308.44,Unlimited,SBD,M,
Boys,67.13,7,Harley Pinkard,De Leon,62.41,106.59,65.77,122.47,294.84,Unlimited,SBD,M,
Boys,74.84,1,Elijah Gonzales,Dublin,72.67,233.6,133.81,222.26,589.67,Unlimited,SBD,M,
Boys,74.84,2,Alonso Moreno,Dublin,73.21,229.06,113.4,215.46,557.92,Unlimited,SBD,M,
Boys,74.84,3,Manuel Ortiz,Comanche,74.75,213.19,140.61,204.12,557.92,Unlimited,SBD,M,
Boys,74.84,4,Lucas Azua,Dublin,73.48,217.72,133.81,188.24,539.77,Unlimited,SBD,M,
Boys,74.84,5,Kayson Bunkley,Hico,72.94,195.04,97.52,185.97,478.54,Unlimited,SBD,M,
Boys,74.84,6,Ben Brumfield,Three Way,74.39,151.95,124.74,197.31,474,Unlimited,SBD,M,
Boys,74.84,7,Cole Chaplin,Stephenville,73.98,170.1,106.59,174.63,451.32,Unlimited,SBD,M,
Boys,74.84,8,Tristan Brewer,Hico,73.35,154.22,99.79,154.22,408.23,Unlimited,SBD,M,
Boys,74.84,9,Ladanian Smith,Comanche,71.76,95.25,102.06,165.56,362.87,Unlimited,SBD,M,
Boys,74.84,10,Kaden Carpenter,Lingleville,73.75,140.61,72.57,145.15,358.34,Unlimited,SBD,M,
Boys,74.84,11,Daniel Rios,Comanche,72.21,133.81,70.31,142.88,347,Unlimited,SBD,M,
Boys,74.84,12,Joseph Johnson,Tolar,71.21,106.59,83.91,136.08,326.59,Unlimited,SBD,M,
Boys,74.84,DQ,Dakota Higgins,Rising Star,73.94,185.97,,,,Unlimited,SBD,M,
Boys,82.1,1,Price Mullin,Hico,77.7,208.65,147.42,219.99,576.06,Unlimited,SBD,M,
Boys,82.1,2,Jovani Cervantes,Dublin,75.75,226.8,127.01,210.92,564.72,Unlimited,SBD,M,
Boys,82.1,3,Hayden Hernandez,Stephenville,81.51,204.12,131.54,199.58,535.24,Unlimited,SBD,M,
Boys,82.1,4,Karsten Brigman,Stephenville,80.51,192.78,120.2,192.78,505.76,Unlimited,SBD,M,
Boys,82.1,5,Logan Trussel,Three Way,81.92,167.83,115.67,192.78,476.27,Unlimited,SBD,M,
Boys,82.1,6,Zaden Tello,Comanche,79.06,167.83,102.06,149.69,419.57,Unlimited,SBD,M,
Boys,82.1,7,Kennon Lee,Hamilton,79.65,142.88,97.52,147.42,387.82,Unlimited,SBD,M,
Boys,82.1,8,Emerson Helmuth,Rising Star,81.19,122.47,74.84,154.22,351.53,Unlimited,SBD,M,
Boys,82.1,9,Eli Stewart,Tolar,76.66,122.47,77.11,131.54,331.12,Unlimited,SBD,M,
Boys,89.81,1,Luke Stacy,Stephenville,88.59,247.21,165.56,219.99,632.76,Unlimited,SBD,M,
Boys,89.81,2,Justin Stephens,Stephenville,87.72,226.8,151.95,244.94,623.69,Unlimited,SBD,M,
Boys,89.81,3,Emmanuel Ramirez,Dublin,88.72,215.46,138.35,215.46,569.26,Unlimited,SBD,M,
Boys,89.81,4,Brayden Cook,Rising Star,82.55,183.7,158.76,217.72,560.19,Unlimited,SBD,M,
Boys,89.81,5,Austin Browder,Stephenville,89.22,210.92,124.74,215.46,551.11,Unlimited,SBD,M,
Boys,89.81,6,Adan Rocha,De Leon,83.1,219.99,133.81,181.44,535.24,Unlimited,SBD,M,
Boys,89.81,7,Connor Bostic,De Leon,86.64,204.12,108.86,208.65,521.63,Unlimited,SBD,M,
Boys,89.81,8,Jon Brumfield,Three Way,89.36,165.56,156.49,192.78,514.83,Unlimited,SBD,M,
Boys,89.81,9,Adrian Tepetate,De Leon,87.32,195.04,111.13,199.58,505.76,Unlimited,SBD,M,
Boys,89.81,10,ELi Garza,De Leon,87.72,142.88,95.25,192.78,430.91,Unlimited,SBD,M,
Boys,89.81,DQ,Noah Block,Hico,83.69,,88.45,136.08,,Unlimited,SBD,M,
Boys,99.79,1,Mason Hodges,Stephenville,98.57,213.19,124.74,208.65,546.58,Unlimited,SBD,M,
Boys,99.79,2,Brazos Boswell,De Leon,97.11,226.8,113.4,195.04,535.24,Unlimited,SBD,M,
Boys,99.79,3,Miles Hatch,Comanche,99.29,206.38,131.54,170.1,508.02,Unlimited,SBD,M,
Boys,99.79,4,Jake Southall,Dublin,94.8,188.24,102.06,179.17,469.47,Unlimited,SBD,M,
Boys,99.79,DQ,Caige Balvantin,Dublin,98.43,192.78,120.2,,,Unlimited,SBD,M,
Boys,99.79,DQ,Jamie Ruble,Rising Star,90.26,,,,,Unlimited,SBD,M,
Boys,99.79,DQ,Anthony Pollard,Rising Star,97.98,,,,,Unlimited,SBD,M,
Boys,109.77,1,Sam Stewart,Tolar,104.33,244.94,151.95,249.48,646.37,Unlimited,SBD,M,
Boys,109.77,2,Ethan Dease,Comanche,103.6,235.87,163.29,222.26,621.42,Unlimited,SBD,M,
Boys,109.77,3,Aiden Everett,Stephenville,102.06,233.6,147.42,204.12,585.13,Unlimited,SBD,M,
Boys,109.77,4,Juan Elecerio,Dublin,104.78,183.7,111.13,190.51,485.34,Unlimited,SBD,M,
Boys,109.77,5,Keoni Edwards,Evant,101.6,170.1,108.86,195.04,474,Unlimited,SBD,M,
Boys,109.77,6,Ryan Gibson,De Leon,103.15,181.44,111.13,181.44,474,Unlimited,SBD,M,
Boys,109.77,7,Jw Rickabaugh,Tolar,100.7,145.15,104.33,158.76,408.23,Unlimited,SBD,M,
Boys,109.77,8,Jayden Rojas,Dublin,102.51,142.88,74.84,163.29,381.02,Unlimited,SBD,M,
Boys,109.77,DQ,Reid Cogburn,Lingleville,101.6,,,,,Unlimited,SBD,M,
Boys,124.74,1,Cooper Doty,Stephenville,122.15,215.46,140.61,219.99,576.06,Unlimited,SBD,M,
Boys,124.74,2,Juan Garcia,De Leon,121.65,226.8,129.27,199.58,555.65,Unlimited,SBD,M,
Boys,124.74,3,Caysen Bergt,Stephenville,121.29,215.46,111.13,188.24,514.83,Unlimited,SBD,M,
Boys,124.74,4,Scotty Prouty,Stephenville,123.06,197.31,138.35,174.63,510.29,Unlimited,SBD,M,
Boys,124.74,5,Baylor Whiteley,De Leon,118.89,165.56,90.72,190.51,446.79,Unlimited,SBD,M,
Boys,139.71,1,Arturo Leija,Stephenville,128.73,204.12,120.2,208.65,532.97,Unlimited,SBD,M,
Boys,139.71,2,Slade Shields,Stephenville,134.9,197.31,138.35,197.31,532.97,Unlimited,SBD,M,
Boys,139.71,3,Zayne Zint,Lingleville,125.96,56.7,45.36,77.11,179.17,Unlimited,SBD,M,
Boys,139.71+,1,Landon Deters,Comanche,177.67,235.87,170.1,249.48,655.44,Unlimited,SBD,M,
Boys,139.71+,2,Danny Lopez,Comanche,143.61,240.4,147.42,163.29,551.11,Unlimited,SBD,M,
