Division,WeightClassKg,Place,Name,Team,BodyweightKg,Best3SquatKg,Best3BenchKg,Best3DeadliftKg,TotalKg,Equipment,Event,Sex
Boys,51.71,1,Carlos Cadena,Waxahachie,50.62,147.42,90.72,170.1,408.23,Single-ply,SBD,M
Boys,55.79,2,Haif Martinez,Lewisville The Colony,51.94,147.42,86.18,140.61,374.21,Single-ply,SBD,M
Boys,55.79,3,Steven Lira,Little Elm,51.8,124.74,86.18,133.81,344.73,Single-ply,SBD,M
Boys,55.79,4,Luke Duvall,North Mesquite,51.89,117.93,70.31,142.88,331.12,Single-ply,SBD,M
Boys,51.71,5,JT White,Cedar Hill,51.71,113.4,54.43,138.35,306.17,Single-ply,SBD,M
Boys,51.71,6,Matt Castillo,North Mesquite,48.08,104.33,54.43,120.2,278.96,Single-ply,SBD,M
Boys,51.71,7,Victor Peluso,Frisco Wakeland,50.17,90.72,81.65,104.33,276.69,Single-ply,SBD,M
Boys,51.71,8,Donovan Hayes,Frisco Centennial,50.17,106.59,58.97,111.13,276.69,Single-ply,SBD,M
Boys,51.71,9,Toni Ogunsola,Frisco,49.9,92.99,65.77,113.4,272.16,Single-ply,SBD,M
Boys,59.87,1,Zach Fain,Cedar Hill,55.97,181.44,97.52,181.44,460.4,Single-ply,SBD,M
Boys,55.79,1,Demitri Sommer,Lewisville The Colony,54.98,124.74,70.31,147.42,342.46,Single-ply,SBD,M
Boys,55.79,2,Daniel Smith,Cedar Hill,54.7,145.15,79.38,145.15,369.68,Single-ply,SBD,M
Boys,55.79,3,Don Kim,Frisco,54.34,117.93,65.77,102.06,285.76,Single-ply,SBD,M
Boys,55.79,4,Brandon Kaprelian,Coppell,54.98,113.4,65.77,99.79,278.96,Single-ply,SBD,M
Boys,59.87,DQ,Christian Medrano,Lewisville The Colony,56.02,122.47,61.23,131.54,,Single-ply,SBD,M
Boys,67.13,1,Richard Hernandez,Lewisville The Colony,60.1,195.04,117.93,183.7,496.68,Single-ply,SBD,M
Boys,67.13,2,Stefan Sommer,Lewisville The Colony,60.1,199.58,104.33,188.24,492.15,Single-ply,SBD,M
Boys,59.87,3,Larkin Alexander,Waxahachie,58.24,161.03,99.79,181.44,442.25,Single-ply,SBD,M
Boys,59.87,4,Carlos Bravo,Lewisville The Colony,58.29,165.56,95.25,167.83,428.64,Single-ply,SBD,M
Boys,59.87,5,Allen Morales,Frisco Centennial,56.61,183.7,72.57,170.1,426.38,Single-ply,SBD,M
Boys,59.87,6,Daniel Cadena,Waxahachie,58.51,136.08,81.65,156.49,374.21,Single-ply,SBD,M
Boys,59.87,7,Cody Lineberry,Ferris,57.42,145.15,95.25,124.74,365.14,Single-ply,SBD,M
Boys,59.87,8,Gerardo Romo,North Mesquite,59.15,129.27,83.91,142.88,356.07,Single-ply,SBD,M
Boys,59.87,9,Uriel Garcia,Ferris,59.6,131.54,79.38,124.74,335.66,Single-ply,SBD,M
Boys,59.87,10,Guillory Duck,Frisco Centennial,58.15,108.86,68.04,151.95,328.85,Single-ply,SBD,M
Boys,59.87,11,Nick Baril,Frisco Centennial,59.15,122.47,74.84,120.2,317.51,Single-ply,SBD,M
Boys,59.87,DQ,Cole Patterson,Lewisville The Colony,59.87,,,,,Single-ply,SBD,M
Boys,59.87,DQ,Sonny Khokar,Frisco Wakeland,57.88,,,,,Single-ply,SBD,M
Boys,67.13,1,Andrew Beckman,Lewisville The Colony,67.13,226.8,131.54,208.65,566.99,Single-ply,SBD,M
Boys,67.13,2,Stanley Lu,Frisco Centennial,65.59,190.51,106.59,208.65,505.76,Single-ply,SBD,M
Boys,67.13,3,Tim Sanders,Lewisville The Colony,67.13,208.65,115.67,181.44,505.76,Single-ply,SBD,M
Boys,67.13,4,Dontae Luke,North Mesquite,66.32,172.37,106.59,181.44,460.4,Single-ply,SBD,M
Boys,67.13,5,Jafus Johnson,Cedar Hill,66.59,154.22,90.72,174.63,419.57,Single-ply,SBD,M
Boys,67.13,6,Jalin Lee,Cedar Hill,64.59,142.88,95.25,179.17,417.3,Single-ply,SBD,M
Boys,67.13,7,Matt Marrs,Little Elm,64.05,156.49,95.25,163.29,415.04,Single-ply,SBD,M
Boys,67.13,8,Nate Jones,Lewisville The Colony,63.5,142.88,90.72,165.56,399.16,Single-ply,SBD,M
Boys,74.84,9,Jeff Smiley,Coppell,67.36,138.35,88.45,167.83,394.63,Single-ply,SBD,M
Boys,67.13,10,Chris Gautier,Frisco Centennial,64.41,145.15,97.52,142.88,385.55,Single-ply,SBD,M
Boys,67.13,11,Bradley Beck,McKinney,62.51,136.08,86.18,156.49,378.75,Single-ply,SBD,M
Boys,67.13,12,Joseph Ogunniyi,Cedar Hill,63.87,133.81,72.57,170.1,376.48,Single-ply,SBD,M
Boys,74.84,13,Andrew Gonzalez,Lewisville The Colony,67.36,154.22,79.38,140.61,374.21,Single-ply,SBD,M
Boys,67.13,14,Terry Waters,Cedar Hill,64.95,147.42,88.45,131.54,367.41,Single-ply,SBD,M
Boys,67.13,15,Christain Byers,Bishop Lynch,62.41,127.01,68.04,147.42,342.46,Single-ply,SBD,M
Boys,67.13,16,Jaelon Graves,Cedar Hill,63.59,108.86,70.31,129.27,308.44,Single-ply,SBD,M
Boys,67.13,17,Cameron Peters,Frisco Centennial,62.51,115.67,74.84,113.4,303.91,Single-ply,SBD,M
Boys,67.13,18,Grant Swenke,Bishop Lynch,61.87,92.99,70.31,127.01,290.3,Single-ply,SBD,M
Boys,67.13,DQ,Tanaka Rusape,Lewisville The Colony,67.13,124.74,61.23,149.69,,Single-ply,SBD,M
Boys,74.84,DQ,Errol Cox,Lewisville The Colony,67.36,115.67,70.31,156.49,,Single-ply,SBD,M
Boys,74.84,1,Cory Sayler,Lewisville The Colony,74.84,256.28,138.35,233.6,628.23,Single-ply,SBD,M
Boys,82.1,2,Vuna Adams,Cedar Hill,74.93,222.26,122.47,217.72,562.45,Single-ply,SBD,M
Boys,74.84,3,Matt Munoz,McKinney,74.57,195.04,102.06,183.7,480.81,Single-ply,SBD,M
Boys,74.84,4,Vincent Chavez,Frisco Centennial,74.84,190.51,106.59,181.44,478.54,Single-ply,SBD,M
Boys,74.84,5,Jarred Askins,Frisco,72.85,199.58,108.86,165.56,474,Single-ply,SBD,M
Boys,74.84,6,Wes Salley,Dallas Parish Episcopal,73.48,170.1,111.13,170.1,451.32,Single-ply,SBD,M
Boys,74.84,7,Bryce Slagle,Little Elm,73.75,163.29,92.99,188.24,444.52,Single-ply,SBD,M
Boys,74.84,8,Josh Pantoja,Bishop Lynch,71.76,163.29,72.57,181.44,417.3,Single-ply,SBD,M
Boys,74.84,9,Cameron Nichols,Little Elm,74.21,167.83,102.06,147.42,417.3,Single-ply,SBD,M
Boys,74.84,10,Emmanuel Mulumba,Coppell,74.12,147.42,97.52,154.22,399.16,Single-ply,SBD,M
Boys,74.84,11,Ross Abraham,Frisco Centennial,73.57,151.95,79.38,158.76,390.09,Single-ply,SBD,M
Boys,74.84,12,Marcus Gentry,Ferris,74.48,142.88,95.25,151.95,390.09,Single-ply,SBD,M
Boys,74.84,13,Travis Barnes,Frisco,71.3,136.08,79.38,170.1,385.55,Single-ply,SBD,M
Boys,74.84,14,Brad Sargent,Bishop Lynch,70.76,136.08,74.84,167.83,378.75,Single-ply,SBD,M
Boys,74.84,15,Christian Han,Coppell,73.21,151.95,86.18,133.81,371.95,Single-ply,SBD,M
Boys,74.84,16,Cam Torres,Bishop Lynch,67.59,136.08,74.84,138.35,349.27,Single-ply,SBD,M
Boys,74.84,17,Logan Miller,Frisco Centennial,68.95,115.67,70.31,129.27,315.25,Single-ply,SBD,M
Boys,74.84,DQ,Ryan Lim,Frisco Centennial,68.22,,,,,Single-ply,SBD,M
Boys,74.84,DQ,Mitchell Anthony,Frisco Wakeland,74.39,,,,,Single-ply,SBD,M
Boys,74.84,DQ,Zack Wilcox,Lewisville The Colony,67.59,,,,,Single-ply,SBD,M
Boys,74.84,DQ,Tryse Williams,Lewisville The Colony,74.84,136.08,61.23,102.06,,Single-ply,SBD,M
Boys,82.1,DQ,Aaron McCarthy,Lewisville The Colony,75.07,156.49,86.18,181.44,,Single-ply,SBD,M
Boys,82.1,DQ,Simon Chan,Lewisville The Colony,75.07,147.42,90.72,142.88,,Single-ply,SBD,M
Boys,74.84,DQ,A. Chapman,Waxahachie,72.67,,,,,Single-ply,SBD,M
Boys,82.1,1,Zack Long,Little Elm,79.83,217.72,129.27,213.19,560.19,Single-ply,SBD,M
Boys,82.1,2,Dillon Bocanegra,Little Elm,81.37,215.46,122.47,204.12,542.04,Single-ply,SBD,M
Boys,82.1,3,Tanner Haynie,Lewisville The Colony,79.38,235.87,106.59,197.31,539.77,Single-ply,SBD,M
Boys,82.1,4,Trez Robinson,Frisco Wakeland,82.01,204.12,113.4,215.46,532.97,Single-ply,SBD,M
Boys,82.1,5,Ruben Mendez,Ferris,82.1,181.44,136.08,206.38,523.9,Single-ply,SBD,M
Boys,82.1,6,Nick Knox,North Mesquite,80.83,199.58,124.74,190.51,514.83,Single-ply,SBD,M
Boys,82.1,7,Josh Tristan,Lewisville The Colony,79.61,185.97,106.59,210.92,503.49,Single-ply,SBD,M
Boys,82.1,8,Josh Ponton,Lewisville The Colony,78.93,188.24,106.59,204.12,498.95,Single-ply,SBD,M
Boys,82.1,9,Horace Bordens,North Mesquite,79.74,199.58,108.86,190.51,498.95,Single-ply,SBD,M
Boys,82.1,10,Cody Montgomery,McKinney,80.2,192.78,113.4,192.78,498.95,Single-ply,SBD,M
Boys,82.1,11,Craig Renfro,Waxahachie,76.02,190.51,97.52,192.78,480.81,Single-ply,SBD,M
Boys,82.1,12,Logan Matamoros,Frisco Centennial,79.38,149.69,113.4,161.03,424.11,Single-ply,SBD,M
Boys,82.1,13,Randy Black,Ferris,80.65,147.42,102.06,172.37,421.84,Single-ply,SBD,M
Boys,82.1,14,Omar Garcia,Lewisville,75.48,151.95,83.91,170.1,405.97,Single-ply,SBD,M
Boys,82.1,15,Chris Hayes,Frisco Centennial,77.02,136.08,83.91,158.76,378.75,Single-ply,SBD,M
Boys,82.1,16,Colton Uzelac,Dallas Parish Episcopal,77.93,151.95,74.84,151.95,378.75,Single-ply,SBD,M
Boys,82.1,17,Conner Lane,Frisco Centennial,79.47,145.15,72.57,142.88,360.61,Single-ply,SBD,M
Boys,82.1,18,Garrett Garner,McKinney,81.47,129.27,77.11,151.95,358.34,Single-ply,SBD,M
Boys,82.1,DQ,Garrett Gableman,McKinney,79.65,,,,,Single-ply,SBD,M
Boys,82.1,DQ,Brad Waggoner,Lewisville The Colony,80.74,111.13,70.31,136.08,,Single-ply,SBD,M
Boys,82.1,DQ,Geoffrey Chan,Lewisville The Colony,79.38,,,,,Single-ply,SBD,M
Boys,82.1,DQ,Mike Denton,Lewisville The Colony,77.11,204.12,92.99,210.92,,Single-ply,SBD,M
Boys,82.1,DQ,Beau Hodges,Lewisville The Colony,81.65,154.22,102.06,170.1,,Single-ply,SBD,M
Boys,82.1,DQ,Steven Ramirez,Lewisville The Colony,82.1,,,,,Single-ply,SBD,M
Boys,82.1,DQ,Lakelon Rice,Frisco Centennial,76.84,,,,,Single-ply,SBD,M
Boys,89.81,1,Tanner Anglin,Frisco Centennial,88.9,240.4,142.88,254.01,637.3,Single-ply,SBD,M
Boys,89.81,2,Justin Murphy #2,Lewisville The Colony,84.59,249.48,147.42,238.14,635.03,Single-ply,SBD,M
Boys,89.81,3,Andrew Kindred,Waxahachie,86.09,238.14,117.93,249.48,605.55,Single-ply,SBD,M
Boys,99.79,4,Brandon January,Dallas Parish Episcopal,90.04,217.72,142.88,226.8,587.4,Single-ply,SBD,M
Boys,89.81,5,Aaron Bailey,Frisco Wakeland,86.55,219.99,120.2,215.46,555.65,Single-ply,SBD,M
Boys,99.79,6,Chris Roberts,Cedar Hill,89.99,204.12,124.74,188.24,517.1,Single-ply,SBD,M
Boys,99.79,7,Freddy Hernandez #2,Little Elm,89.9,185.97,127.01,195.04,508.02,Single-ply,SBD,M
Boys,99.79,8,Sir Wells,Lewisville The Colony,90.04,204.12,86.18,215.46,505.76,Single-ply,SBD,M
Boys,89.81,9,Chuck Opuita,North Mesquite,88.45,181.44,106.59,213.19,501.22,Single-ply,SBD,M
Boys,89.81,10,Safari Bolden,Cedar Hill,89.63,174.63,111.13,195.04,480.81,Single-ply,SBD,M
Boys,99.79,11,Derek Gourley,Frisco,89.99,183.7,115.67,170.1,469.47,Single-ply,SBD,M
Boys,89.81,12,Nick Sandoval,North Mesquite,83.73,183.7,115.67,158.76,458.13,Single-ply,SBD,M
Boys,89.81,13,Derek Chase,Cedar Hill,84.91,170.1,97.52,172.37,439.98,Single-ply,SBD,M
Boys,89.81,14,Chris Hendricks,Frisco Wakeland,83.55,170.1,90.72,174.63,435.45,Single-ply,SBD,M
Boys,89.81,15,Ryan McCary,Frisco,89.27,158.76,102.06,161.03,421.84,Single-ply,SBD,M
Boys,89.81,16,Cameron Bennett,Cedar Hill,85.37,154.22,115.67,142.88,412.77,Single-ply,SBD,M
Boys,89.81,17,Matthew Duran,Ferris,83.01,170.1,92.99,147.42,410.5,Single-ply,SBD,M
Boys,89.81,18,Agustine Zavala,McKinney,87.18,151.95,90.72,163.29,405.97,Single-ply,SBD,M
Boys,89.81,19,Efe Nesiama,Coppell,83.55,151.95,97.52,151.95,401.43,Single-ply,SBD,M
Boys,89.81,20,Martin Guerrero,Ferris,89.27,158.76,90.72,147.42,396.89,Single-ply,SBD,M
Boys,89.81,21,Cameron Davis #6,Bishop Lynch,88.72,142.88,68.04,136.08,347,Single-ply,SBD,M
Boys,89.81,22,Chaz Miller,Bishop Lynch,86.45,124.74,79.38,138.35,342.46,Single-ply,SBD,M
Boys,89.81,23,Eric Ramon,Bishop Lynch,88.18,95.25,47.63,99.79,242.67,Single-ply,SBD,M
Boys,89.81,DQ,Jacob Kohlschmidt,McKinney,87.18,,,,,Single-ply,SBD,M
Boys,89.81,DQ,Adrian Garcia,Ferris,84.82,,,,,Single-ply,SBD,M
Boys,89.81,DQ,Edgar Reyes,Lewisville The Colony,88.45,108.86,61.23,108.86,,Single-ply,SBD,M
Boys,99.79,1,Reggie Wilcox,Frisco Wakeland,97.34,263.08,147.42,254.01,664.51,Single-ply,SBD,M
Boys,99.79,2,Milton Ricks,Lewisville,90.72,226.8,122.47,247.21,596.47,Single-ply,SBD,M
Boys,99.79,3,Reed Standly,Dallas Parish Episcopal,93.98,215.46,136.08,233.6,585.13,Single-ply,SBD,M
Boys,99.79,4,Naveed Amirhek,Coppell,93.17,215.46,158.76,208.65,582.87,Single-ply,SBD,M
Boys,99.79,5,Bryan Randall,Waxahachie,93.08,208.65,131.54,219.99,560.19,Single-ply,SBD,M
Boys,99.79,6,Derek Lanham,Lewisville The Colony,91.63,238.14,104.33,206.38,548.85,Single-ply,SBD,M
Boys,99.79,7,Dezmond Scott,North Mesquite,90.45,219.99,117.93,208.65,546.58,Single-ply,SBD,M
Boys,99.79,8,Chad Pennywell,Frisco Wakeland,98.52,219.99,131.54,192.78,544.31,Single-ply,SBD,M
Boys,99.79,9,Darius Stubblefield,Cedar Hill,99.79,197.31,142.88,199.58,539.77,Single-ply,SBD,M
Boys,99.79,10,David Miller #7,Little Elm,97.43,208.65,120.2,195.04,523.9,Single-ply,SBD,M
Boys,99.79,11,Corey Feagin,Cedar Hill,96.43,192.78,120.2,197.31,510.29,Single-ply,SBD,M
Boys,99.79,12,Cameron Gschwend,Frisco Centennial,91.26,215.46,108.86,183.7,508.02,Single-ply,SBD,M
Boys,99.79,13,Reid Berry,Dallas Parish Episcopal,91.26,192.78,117.93,192.78,503.49,Single-ply,SBD,M
Boys,99.79,14,Rene Zavala,Waxahachie,90.99,179.17,138.35,181.44,498.95,Single-ply,SBD,M
Boys,99.79,15,Michael Quast,Coppell,92.08,183.7,131.54,183.7,498.95,Single-ply,SBD,M
Boys,99.79,16,Fizz Hossain,Frisco,93.53,192.78,102.06,192.78,487.61,Single-ply,SBD,M
Boys,99.79,17,Ryan Joyce,Frisco Centennial,95.62,174.63,117.93,183.7,476.27,Single-ply,SBD,M
Boys,99.79,18,Miguel Martinez,Cedar Hill,98.16,181.44,102.06,190.51,474,Single-ply,SBD,M
Boys,99.79,19,Calen Johnson,Cedar Hill,92.8,185.97,102.06,181.44,469.47,Single-ply,SBD,M
Boys,99.79,20,William Udeh,Coppell,97.52,170.1,108.86,165.56,444.52,Single-ply,SBD,M
Boys,99.79,21,Cody Kovach,Lewisville,99.34,170.1,97.52,142.88,410.5,Single-ply,SBD,M
Boys,99.79,22,Mike Rineheart,Bishop Lynch,94.08,145.15,79.38,181.44,405.97,Single-ply,SBD,M
Boys,99.79,23,Matt Spradling,McKinney,97.79,149.69,90.72,129.27,369.68,Single-ply,SBD,M
Boys,99.79,24,Ethan Young,Bishop Lynch,95.62,142.88,81.65,131.54,356.07,Single-ply,SBD,M
Boys,99.79,DQ,Tony Dwyer,Bishop Lynch,99.79,,,,,Single-ply,SBD,M
Boys,99.79,DQ,Isaiah Hinton,Lewisville The Colony,98.43,183.7,95.25,156.49,,Single-ply,SBD,M
Boys,109.77,1,Josh Morrison,Lewisville The Colony,109.77,290.3,176.9,240.4,707.6,Single-ply,SBD,M
Boys,109.77,2,Austin Vela,Frisco Wakeland,105.51,260.82,181.44,238.14,680.39,Single-ply,SBD,M
Boys,109.77,3,John Mark Johnson,Dallas Parish Episcopal,105.41,249.48,183.7,226.8,659.98,Single-ply,SBD,M
Boys,109.77,4,Joe Bergeron,North Mesquite,101.7,242.67,145.15,249.48,637.3,Single-ply,SBD,M
Boys,109.77,5,Robbie Murray,Lewisville The Colony,106.59,238.14,147.42,226.8,612.35,Single-ply,SBD,M
Boys,109.77,6,Gasteneau Fisher,Cedar Hill,105.87,226.8,129.27,235.87,591.94,Single-ply,SBD,M
Boys,109.77,7,Dustin Upchurch,Waxahachie,105.69,210.92,115.67,213.19,539.77,Single-ply,SBD,M
Boys,109.77,8,James Mann,Waxahachie,106.96,215.46,115.67,199.58,530.7,Single-ply,SBD,M
Boys,109.77,9,Roy Chaney,Ferris,109.32,213.19,115.67,183.7,512.56,Single-ply,SBD,M
Boys,109.77,10,Kyle Flowers,Frisco Wakeland,102.87,192.78,129.27,185.97,508.02,Single-ply,SBD,M
Boys,109.77,11,Julian Roland,Cedar Hill,106.59,190.51,113.4,190.51,494.42,Single-ply,SBD,M
Boys,109.77,12,Elliot Parkman,McKinney,104.6,170.1,102.06,181.44,453.59,Single-ply,SBD,M
Boys,109.77,13,Sabeti Sabeti,Coppell,105.78,142.88,117.93,172.37,433.18,Single-ply,SBD,M
Boys,109.77,14,Vinny Wurst,Bishop Lynch,100.15,147.42,86.18,158.76,392.36,Single-ply,SBD,M
Boys,109.77,15,Jonathan Shuster,McKinney,109.04,145.15,83.91,142.88,371.95,Single-ply,SBD,M
Boys,109.77,DQ,Sam Preston #1,Lewisville The Colony,108.86,199.58,111.13,197.31,,Single-ply,SBD,M
Boys,124.74,1,Ricky Gonzales,Cedar Hill,123.83,267.62,188.24,247.21,703.07,Single-ply,SBD,M
Boys,124.74,2,Aric Rodriguez,Little Elm,123.65,272.16,163.29,222.26,657.71,Single-ply,SBD,M
Boys,124.74,3,Nestor Hernandez,Dallas Parish Episcopal,113.31,240.4,124.74,240.4,605.55,Single-ply,SBD,M
Boys,124.74,4,Taylor Lasecki,Frisco,114.67,219.99,167.83,204.12,591.94,Single-ply,SBD,M
Boys,124.74,5,Chase Applebee,Frisco Centennial,120.29,229.06,138.35,208.65,576.06,Single-ply,SBD,M
Boys,124.74,6,Connor Lambring,Frisco,117.66,226.8,138.35,199.58,564.72,Single-ply,SBD,M
Boys,124.74,7,Tai Nguyen #1,Frisco,121.65,226.8,136.08,195.04,557.92,Single-ply,SBD,M
Boys,124.74,8,Jerome Daniels,Little Elm,123.29,213.19,136.08,176.9,526.17,Single-ply,SBD,M
Boys,124.74,9,David Van Amburgh,Dallas Parish Episcopal,116.48,199.58,131.54,190.51,521.63,Single-ply,SBD,M
Boys,124.74,10,Damarcus Henderson,Lewisville The Colony,120.66,208.65,102.06,204.12,514.83,Single-ply,SBD,M
Boys,124.74,11,Kyle Boren,Frisco,116.3,192.78,117.93,192.78,503.49,Single-ply,SBD,M
Boys,124.74,12,Oni Omoile,Coppell,118.57,195.04,117.93,181.44,494.42,Single-ply,SBD,M
Boys,124.74,13,Andrew Akens,North Mesquite,119.29,204.12,115.67,172.37,492.15,Single-ply,SBD,M
Boys,124.74,14,Kyle Lineberry,Ferris,119.02,199.58,115.67,156.49,471.74,Single-ply,SBD,M
Boys,124.74,15,Daniel Kim,Lewisville The Colony,124.1,185.97,92.99,183.7,462.66,Single-ply,SBD,M
Boys,124.74,16,Carter Flemmer,Frisco,122.83,181.44,102.06,170.1,453.59,Single-ply,SBD,M
Boys,124.74,DQ,Bijzon Brown,Lewisville The Colony,111.4,167.83,97.52,158.76,,Single-ply,SBD,M
Boys,124.74+,1,Josh Burkham,Lewisville The Colony,138.35,294.84,181.44,260.82,737.09,Single-ply,SBD,M
Boys,124.74+,2,DJ Willis,Lewisville The Colony,135.85,272.16,147.42,263.08,682.66,Single-ply,SBD,M
Boys,124.74+,3,David Cortinas,Ferris,136.62,229.06,131.54,197.31,557.92,Single-ply,SBD,M
Boys,124.74+,4,Genard Johnson,Waxahachie,134.35,204.12,117.93,215.46,537.51,Single-ply,SBD,M
Boys,124.74+,5,Jake Williams #3,Coppell,140.98,199.58,113.4,197.31,510.29,Single-ply,SBD,M
Boys,124.74+,6,Aderius Epps,Cedar Hill,131.09,188.24,122.47,195.04,505.76,Single-ply,SBD,M
Boys,124.74+,7,Emilio Pimera,Coppell,127.28,192.78,102.06,181.44,476.27,Single-ply,SBD,M
Boys,124.74+,DQ,Zack Wellman,Lewisville The Colony,131.54,115.67,83.91,111.13,,Single-ply,SBD,M
