Division,WeightClassKg,Place,Name,Team,BodyweightKg,Best3SquatKg,Best3BenchKg,Best3DeadliftKg,TotalKg,Equipment,Event,Sex
Boys,51.71,1,Jagger Onstott,Tyler Lee,49.71,97.52,54.43,117.93,269.89,Single-ply,SBD,M
Boys,55.79,2,Cody McQueen,Fairfield,51.89,104.33,47.63,113.4,265.35,Single-ply,SBD,M
Boys,51.71,3,Deandre Gaston,Tyler Lee,46.99,102.06,54.43,97.52,254.01,Single-ply,SBD,M
Boys,51.71,DQ,Tristian Ussery,Blooming Grove,51.71,,,,,Single-ply,SBD,M
Boys,55.79,1,Johney Phelps,Palestine Westwood,54.61,170.1,86.18,161.03,417.3,Single-ply,SBD,M
Boys,55.79,2,Johnny Martinez,Belton,54.16,122.47,79.38,151.95,353.8,Single-ply,SBD,M
Boys,55.79,3,Zaki Hill,Belton,53.52,131.54,61.23,140.61,333.39,Single-ply,SBD,M
Boys,55.79,4,Dillion McCastland,Italy,53.61,106.59,52.16,106.59,265.35,Single-ply,SBD,M
Boys,55.79,DQ,Tylor Chandler,Scurry-Rosser,55.16,129.27,58.97,,,Single-ply,SBD,M
Boys,59.87,1,Luis Juarez,Bosqueville,59.78,201.85,117.93,201.85,521.63,Single-ply,SBD,M
Boys,59.87,2,Jaleen Pickett,Madisonville,58.79,165.56,74.84,163.29,403.7,Single-ply,SBD,M
Boys,59.87,3,Jacob McLean,Scurry-Rosser,59.51,154.22,83.91,163.29,401.43,Single-ply,SBD,M
Boys,59.87,4,Quintin Cannon,Belton,58.88,138.35,88.45,161.03,387.82,Single-ply,SBD,M
Boys,59.87,5,Nolan Jackson,Lorena,59.87,158.76,72.57,147.42,378.75,Single-ply,SBD,M
Boys,67.13,6,Ellis Reyes,Madisonville,59.96,129.27,86.18,142.88,358.34,Single-ply,SBD,M
Boys,59.87,7,Morgan Adams #2,Blooming Grove,57.06,106.59,70.31,113.4,290.3,Single-ply,SBD,M
Boys,59.87,8,Johnny Cabrera,Fairfield,58.24,95.25,56.7,124.74,276.69,Single-ply,SBD,M
Boys,59.87,DQ,Zach Neves,Teague,59.87,,,,,Single-ply,SBD,M
Boys,67.13,1,Jared Arey,Teague,65.41,206.38,104.33,201.85,512.56,Single-ply,SBD,M
Boys,67.13,2,Daniel Camarillo,Blooming Grove,65.05,181.44,106.59,185.97,474,Single-ply,SBD,M
Boys,67.13,3,Jalen Burns,Palestine Westwood,66.68,188.24,81.65,201.85,471.74,Single-ply,SBD,M
Boys,74.84,4,Brent Mason,Brownsboro,67.22,183.7,90.72,183.7,458.13,Single-ply,SBD,M
Boys,67.13,5,Carter Taylor,Brownsboro,65.14,174.63,104.33,170.1,449.06,Single-ply,SBD,M
Boys,67.13,6,Nick Harris,Madisonville,65.41,172.37,92.99,165.56,430.91,Single-ply,SBD,M
Boys,67.13,7,Colton Bauer,Lorena,66.86,165.56,92.99,163.29,421.84,Single-ply,SBD,M
Boys,67.13,8,Jt Jones,Teague,62.14,151.95,77.11,161.03,390.09,Single-ply,SBD,M
Boys,67.13,9,Nick Mooneyham,Fairfield,65.5,138.35,81.65,163.29,383.29,Single-ply,SBD,M
Boys,67.13,10,Brian Griffin,Scurry-Rosser,63.41,108.86,52.16,122.47,283.5,Single-ply,SBD,M
Boys,67.13,DQ,Bryce Wilkerson,Tyler Lee,64.59,210.92,102.06,,,Single-ply,SBD,M
Boys,67.13,DQ,Dustin Richter,Bosqueville,62.87,115.67,54.43,,,Single-ply,SBD,M
Boys,74.84,DQ,Andrew Marrero,Lorena,67.22,204.12,97.52,,,Single-ply,SBD,M
Boys,67.13,DQ,Nick Snodgrass,Blooming Grove,67.13,,,,,Single-ply,SBD,M
Boys,67.13,DQ,Cameron Varner,Buffalo,66.13,181.44,,,,Single-ply,SBD,M
Boys,74.84,1,Deandre Allen,Tyler Lee,70.85,213.19,106.59,213.19,532.97,Single-ply,SBD,M
Boys,74.84,2,Tristan Williams,Rusk,73.75,176.9,120.2,176.9,474,Single-ply,SBD,M
Boys,74.84,3,JaColby Forge,Mexia,74.57,147.42,88.45,199.58,435.45,Single-ply,SBD,M
Boys,74.84,4,Jesse Landess,Scurry-Rosser,73.94,165.56,97.52,161.03,424.11,Single-ply,SBD,M
Boys,74.84,5,Alex Smith #9,Bosqueville,74.66,174.63,90.72,158.76,424.11,Single-ply,SBD,M
Boys,82.1,6,Josh Thompson,Brownsboro,74.93,156.49,83.91,142.88,383.29,Single-ply,SBD,M
Boys,74.84,7,Sammy Cervantes,Buffalo,70.03,136.08,74.84,158.76,369.68,Single-ply,SBD,M
Boys,74.84,8,Jed Wout,Blooming Grove,72.03,113.4,77.11,147.42,337.93,Single-ply,SBD,M
Boys,74.84,9,Alex Tovar,Blooming Grove,72.85,108.86,74.84,147.42,331.12,Single-ply,SBD,M
Boys,74.84,10,Owen Awalt,Fairfield,72.67,108.86,54.43,136.08,299.37,Single-ply,SBD,M
Boys,74.84,DQ,Darius Dorsey,Mexia,74.84,,,,,Single-ply,SBD,M
Boys,74.84,DQ,Slayden Morgan,Teague,74.84,,,,,Single-ply,SBD,M
Boys,74.84,DQ,Hayden Roberts,Teague,74.84,,,,,Single-ply,SBD,M
Boys,74.84,DQ,Michael Cartwright,Brownsboro,74.84,,,,,Single-ply,SBD,M
Boys,82.1,1,Jeremy Turner,Rusk,79.47,249.48,136.08,254.01,639.57,Single-ply,SBD,M
Boys,82.1,2,Desmond Dunn,Tyler Lee,76.75,199.58,106.59,210.92,517.1,Single-ply,SBD,M
Boys,82.1,3,Joseph Warehime,Belton,78.56,199.58,122.47,185.97,508.02,Single-ply,SBD,M
Boys,82.1,4,Alberto Carillo,Mexia,80.1,183.7,113.4,181.44,478.54,Single-ply,SBD,M
Boys,82.1,5,Cesar Lopez,Groesbeck,79.83,179.17,104.33,179.17,462.66,Single-ply,SBD,M
Boys,82.1,6,Jacob Allred,Fairfield,80.38,142.88,74.84,149.69,367.41,Single-ply,SBD,M
Boys,82.1,7,Cody Neal,Mexia,78.93,122.47,79.38,151.95,353.8,Single-ply,SBD,M
Boys,82.1,DQ,Shad Newman,Italy,82.1,,,,,Single-ply,SBD,M
Boys,82.1,DQ,Kyle Fortenberry,Italy,82.1,,,,,Single-ply,SBD,M
Boys,82.1,DQ,Tristan Bussell,Brownsboro,82.1,,,,,Single-ply,SBD,M
Boys,89.81,1,Aaron Chitwood,Brownsboro,89.72,238.14,136.08,226.8,601.01,Single-ply,SBD,M
Boys,89.81,2,Jeremiah Simpson,Fairfield,89.09,233.6,115.67,199.58,548.85,Single-ply,SBD,M
Boys,89.81,3,Lovett Ledger,Lorena,84.82,233.6,106.59,204.12,544.31,Single-ply,SBD,M
Boys,89.81,4,Chase Kilpatrick,Fairfield,86.91,172.37,95.25,174.63,442.25,Single-ply,SBD,M
Boys,89.81,5,Aaron Pfleeger,Fairfield,89.63,149.69,81.65,158.76,390.09,Single-ply,SBD,M
Boys,99.79,6,Kenneth Norwood,Italy,90.04,99.79,65.77,117.93,283.5,Single-ply,SBD,M
Boys,89.81,DQ,Jacob Gomez,Teague,89.81,,,,,Single-ply,SBD,M
Boys,89.81,DQ,Jose Perez #20,Teague,89.81,,,,,Single-ply,SBD,M
Boys,89.81,DQ,Rodrigo Morales,Teague,89.81,,,,,Single-ply,SBD,M
Boys,89.81,DQ,Matt Mooneyham,Fairfield,89.81,,,,,Single-ply,SBD,M
Boys,99.79,1,Quavious Gamble,Mexia,92.26,231.33,113.4,233.6,578.33,Single-ply,SBD,M
Boys,99.79,2,Trey Watson,Tyler Lee,98.52,219.99,115.67,210.92,546.58,Single-ply,SBD,M
Boys,99.79,3,Cole Beddingfield,Fairfield,94.17,226.8,122.47,185.97,535.24,Single-ply,SBD,M
Boys,99.79,4,Seth Folsom,Buffalo,95.35,204.12,90.72,197.31,492.15,Single-ply,SBD,M
Boys,99.79,5,Jimmy Landess,Scurry-Rosser,91.35,170.1,90.72,190.51,451.32,Single-ply,SBD,M
Boys,99.79,6,Rahi Patel,Mexia,93.17,158.76,104.33,170.1,433.18,Single-ply,SBD,M
Boys,99.79,7,Josh Wiggins,Blooming Grove,90.99,136.08,92.99,167.83,396.89,Single-ply,SBD,M
Boys,99.79,DQ,Arkiel Winn,Mexia,99.79,,,,,Single-ply,SBD,M
Boys,99.79,DQ,Gerardo Calixtro,Teague,99.79,,,,,Single-ply,SBD,M
Boys,109.77,1,Leal Sample,Scurry-Rosser,105.51,240.4,158.76,238.14,637.3,Single-ply,SBD,M
Boys,109.77,2,James Barron,Tyler Lee,108.59,226.8,129.27,233.6,589.67,Single-ply,SBD,M
Boys,109.77,3,Jose Reyes,Mexia,107.59,235.87,124.74,210.92,571.53,Single-ply,SBD,M
Boys,109.77,4,Brad Lafoy,Teague,104.33,229.06,111.13,213.19,553.38,Single-ply,SBD,M
Boys,109.77,5,Jaime Saucedo,Bosqueville,102.69,210.92,108.86,192.78,512.56,Single-ply,SBD,M
Boys,109.77,6,Cryer Lane,Scurry-Rosser,105.96,192.78,117.93,195.04,505.76,Single-ply,SBD,M
Boys,109.77,7,Clint Guyton,Buffalo,107.86,181.44,106.59,147.42,435.45,Single-ply,SBD,M
Boys,109.77,8,Jax Donohoo,Fairfield,108.5,181.44,106.59,140.61,428.64,Single-ply,SBD,M
Boys,109.77,9,Chris Palmer,Scurry-Rosser,103.87,158.76,68.04,145.15,371.95,Single-ply,SBD,M
Boys,109.77,DQ,Ricardo Molina,Mexia,109.77,,,,,Single-ply,SBD,M
Boys,124.74,1,Trent Andrews,Bosqueville,122.2,306.17,156.49,281.23,743.89,Single-ply,SBD,M
Boys,124.74,2,Ryan Mitchell #2,Teague,116.03,294.84,151.95,263.08,709.87,Single-ply,SBD,M
Boys,124.74,3,Garrett Brunson,Lorena,117.57,263.08,145.15,233.6,641.83,Single-ply,SBD,M
Boys,124.74,4,Jerry Villela,Tyler Lee,113.22,247.21,142.88,229.06,619.15,Single-ply,SBD,M
Boys,124.74,5,Cory Green,Tyler Lee,113.31,242.67,115.67,219.99,578.33,Single-ply,SBD,M
Boys,124.74,6,Bryce Hoffman,Rusk,115.03,235.87,124.74,210.92,571.53,Single-ply,SBD,M
Boys,124.74,7,Bryston Parker,Tyler Lee,113.4,226.8,133.81,204.12,564.72,Single-ply,SBD,M
Boys,124.74,8,Zack Morgan,Groesbeck,113.4,226.8,113.4,195.04,535.24,Single-ply,SBD,M
Boys,124.74,9,Steven King,Groesbeck,122.47,188.24,145.15,185.97,519.36,Single-ply,SBD,M
Boys,124.74,10,Zach Ramos,Brownsboro,120.84,174.63,129.27,142.88,446.79,Single-ply,SBD,M
Boys,124.74+,DQ,Devon Pinkerton,Tyler Lee,124.83,238.14,97.52,,,Single-ply,SBD,M
Boys,124.74+,1,Demetri Freeman,Mexia,134.54,197.31,102.06,192.78,492.15,Single-ply,SBD,M
Boys,124.74+,2,Trederek Anglin,Mexia,145.33,185.97,106.59,195.04,487.61,Single-ply,SBD,M
Boys,124.74+,3,Hunter Haynes,Fairfield,125.19,195.04,81.65,145.15,421.84,Single-ply,SBD,M
Boys,124.74+,DQ,Hank Seabolt,Blooming Grove,135.17,249.48,124.74,,,Single-ply,SBD,M
Boys,124.74+,DQ,Christian Slade,Buffalo,136.08,,,,,Single-ply,SBD,M
Boys,124.74+,DQ,Juan Gomez #14,Brownsboro,136.08,,,,,Single-ply,SBD,M
Boys,124.74+,DQ,Dalton Hatcher,Scurry-Rosser,136.08,,,,,Single-ply,SBD,M
