Division,WeightClassKg,Place,Name,Team,BodyweightKg,Best3SquatKg,Best3BenchKg,Best3DeadliftKg,TotalKg,Equipment,Event,Sex,BirthDate
Boys,55.79,1,Jacob Nollola,Stanton,55.79,136.08,74.84,145.15,356.07,Unlimited,SBD,M,
Boys,59.87,1,Fabian Armendariz,Slaton,59.87,174.63,117.93,195.04,487.61,Unlimited,SBD,M,
Boys,59.87,2,Daniel Longoria,Plains,59.87,138.35,83.91,172.37,394.63,Unlimited,SBD,M,
Boys,59.87,3,Aiden Nelms,Plains,59.87,138.35,83.91,149.69,371.95,Unlimited,SBD,M,
Boys,59.87,4,Bryan Cecena,Friona,59.87,111.13,79.38,127.01,317.51,Unlimited,SBD,M,
Boys,59.87,5,Gio Santiago,Friona,59.87,86.18,45.36,95.25,226.8,Unlimited,SBD,M,
Boys,67.13,1,Gael Lara,Friona,66.68,181.44,108.86,181.44,471.74,Unlimited,SBD,M,
Boys,67.13,2,Zamion Davila,Slaton,62.6,167.83,106.59,190.51,464.93,Unlimited,SBD,M,
Boys,67.13,3,Conner Lewis,Slaton,66.22,149.69,90.72,183.7,424.11,Unlimited,SBD,M,
Boys,67.13,4,Josiah Carrizales,Denver City,67.13,156.49,102.06,149.69,408.23,Unlimited,SBD,M,
Boys,67.13,5,Maddox Murrell,Plains,67.13,142.88,79.38,183.7,405.97,Unlimited,SBD,M,
Boys,67.13,6,Tony Briones,Denver City,66.68,158.76,83.91,149.69,392.36,Unlimited,SBD,M,
Boys,67.13,7,Yoslhan Mawatari,Slaton,66.22,136.08,97.52,147.42,381.02,Unlimited,SBD,M,
Boys,67.13,8,Greyson Peterson,Seminole,66.77,142.88,83.91,149.69,376.48,Unlimited,SBD,M,
Boys,67.13,9,Ryker Anderson,Shallowater,67.13,140.61,95.25,133.81,369.68,Unlimited,SBD,M,
Boys,67.13,10,Caidn Surber,Slaton,65.32,124.74,88.45,151.95,365.14,Unlimited,SBD,M,
Boys,67.13,11,Gael Ortega,Denver City,65.77,43.09,43.09,92.99,179.17,Unlimited,SBD,M,
Boys,67.13,DQ,Ray Saldana,Seminole,62.51,,,,,Unlimited,SBD,M,
Boys,74.84,1,Seth Batson,Shallowater,74.84,215.46,149.69,208.65,573.79,Unlimited,SBD,M,
Boys,74.84,2,Aaron Rosales,Friona,74.84,229.06,131.54,206.38,566.99,Unlimited,SBD,M,
Boys,74.84,3,Lucianio Garcia,Slaton,73.57,181.44,120.2,165.56,467.2,Unlimited,SBD,M,
Boys,74.84,4,Austin Simmons,Slaton,69.4,165.56,122.47,165.56,453.59,Unlimited,SBD,M,
Boys,74.84,5,Epifanio Bentancout III,Slaton,73.94,154.22,104.33,170.1,428.64,Unlimited,SBD,M,
Boys,74.84,6,Brady Robles,Plains,74.84,138.35,92.99,167.83,399.16,Unlimited,SBD,M,
Boys,74.84,7,Juan C Villa,Denver City,74.84,142.88,102.06,151.95,396.89,Unlimited,SBD,M,
Boys,74.84,8,Francisco Olvera,Seminole,74.03,142.88,102.06,149.69,394.63,Unlimited,SBD,M,
Boys,74.84,9,Diego Velasquez,Denver City,74.84,154.22,95.25,136.08,385.55,Unlimited,SBD,M,
Boys,74.84,10,Emerson Whitworth-King,Shallowater,74.84,136.08,88.45,156.49,381.02,Unlimited,SBD,M,
Boys,74.84,11,Otto Wiebe,Seminole,71.49,117.93,99.79,156.49,374.21,Unlimited,SBD,M,
Boys,74.84,12,Max Reyes,Friona,74.84,133.81,99.79,129.27,362.87,Unlimited,SBD,M,
Boys,74.84,13,Luis Anaya,Stanton,74.84,142.88,83.91,127.01,353.8,Unlimited,SBD,M,
Boys,74.84,14,Carson Wade,Seminole,68.22,120.2,68.04,151.95,340.19,Unlimited,SBD,M,
Boys,74.84,15,Brik Pruitt,Shallowater,74.84,129.27,79.38,111.13,319.78,Unlimited,SBD,M,
Boys,74.84,16,Jaden Garcia,Seminole,73.07,102.06,52.16,158.76,312.98,Unlimited,SBD,M,
Boys,74.84,DQ,Thomas Cardenas,Slaton,68.95,,,,,Unlimited,SBD,M,
Boys,74.84,DQ,Jason Salgado,Stanton,74.84,,,,,Unlimited,SBD,M,
Boys,82.1,1,Mason Martinez,Slaton,81.74,240.4,158.76,238.14,637.3,Unlimited,SBD,M,
Boys,82.1,2,Nolan Wolfe,Slaton,82.1,192.78,124.74,195.04,512.56,Unlimited,SBD,M,
Boys,82.1,3,Zeke Rodriguez,Denver City,82.1,197.31,120.2,188.24,505.76,Unlimited,SBD,M,
Boys,82.1,4,Thayne Gernentz,Stanton,82.1,163.29,115.67,167.83,446.79,Unlimited,SBD,M,
Boys,82.1,5,Gael Lozano,Plains,82.1,176.9,90.72,170.1,437.72,Unlimited,SBD,M,
Boys,82.1,6,William Turney,Shallowater,82.1,163.29,108.86,156.49,428.64,Unlimited,SBD,M,
Boys,82.1,7,Mario Molina,Friona,82.1,154.22,104.33,167.83,426.38,Unlimited,SBD,M,
Boys,82.1,8,Jacob Gonzalez,Friona,82.1,167.83,106.59,147.42,421.84,Unlimited,SBD,M,
Boys,82.1,9,Guage Galvan,Denver City,81.19,147.42,104.33,154.22,405.97,Unlimited,SBD,M,
Boys,82.1,10,Damian Collis,Shallowater,82.1,142.88,90.72,167.83,401.43,Unlimited,SBD,M,
Boys,82.1,11,Jesus Caro,Plains,81.65,131.54,90.72,163.29,385.55,Unlimited,SBD,M,
Boys,82.1,12,Juan Villa,Denver City,82.1,113.4,90.72,127.01,331.12,Unlimited,SBD,M,
Boys,89.81,1,Ivan Leyva,Denver City,87.09,244.94,156.49,240.4,641.83,Unlimited,SBD,M,
Boys,89.81,2,Jake Benedict,Stanton,89.81,213.19,142.88,204.12,560.19,Unlimited,SBD,M,
Boys,89.81,3,Luis Enriquez,Seminole,85.59,149.69,117.93,151.95,419.57,Unlimited,SBD,M,
Boys,89.81,4,Adrian Ortiz,Shallowater,89.81,156.49,86.18,156.49,399.16,Unlimited,SBD,M,
Boys,89.81,5,Frank Morales,Seminole,83.46,124.74,77.11,170.1,371.95,Unlimited,SBD,M,
Boys,89.81,6,Isaiah Gonzalez,Friona,89.81,131.54,95.25,131.54,358.34,Unlimited,SBD,M,
Boys,89.81,7,Aaron Archuleta,Seminole,86.73,108.86,58.97,124.74,292.57,Unlimited,SBD,M,
Boys,99.79,1,Jonathan Badillo,Plains,99.34,229.06,147.42,219.99,596.47,Unlimited,SBD,M,
Boys,99.79,2,Christian Frausto,Shallowater,99.79,204.12,138.35,226.8,569.26,Unlimited,SBD,M,
Boys,99.79,3,Josue Gallegos,Slaton,95.25,206.38,124.74,233.6,564.72,Unlimited,SBD,M,
Boys,99.79,4,Jacson Price,Shallowater,91.17,151.95,129.27,195.04,476.27,Unlimited,SBD,M,
Boys,99.79,5,Sebastian Pena,Stanton,99.79,188.24,120.2,158.76,467.2,Unlimited,SBD,M,
Boys,99.79,6,Colby Sanders,Seminole,93.39,151.95,104.33,174.63,430.91,Unlimited,SBD,M,
Boys,99.79,DQ,Halen Hadley,Seminole,94.39,,,,,Unlimited,SBD,M,
Boys,109.77,1,Gerrit Boschma,Shallowater,109.77,260.82,149.69,206.38,616.89,Unlimited,SBD,M,
Boys,109.77,2,Cooper Gernentz,Stanton,109.77,229.06,154.22,213.19,596.47,Unlimited,SBD,M,
Boys,109.77,3,Truitt Vaughn,Shallowater,109.77,215.46,136.08,197.31,548.85,Unlimited,SBD,M,
Boys,109.77,4,Andres Hernandez,Denver City,106.59,208.65,136.08,183.7,528.44,Unlimited,SBD,M,
Boys,109.77,5,Reid Turney,Stanton,109.77,208.65,138.35,163.29,510.29,Unlimited,SBD,M,
Boys,109.77,6,Nathan Molina,Shallowater,109.77,192.78,124.74,183.7,501.22,Unlimited,SBD,M,
Boys,109.77,7,Romeo Castillo,Plains,109.77,192.78,120.2,183.7,496.68,Unlimited,SBD,M,
Boys,109.77,8,Israel Contreras,Plains,109.77,174.63,117.93,149.69,442.25,Unlimited,SBD,M,
Boys,109.77,9,Jett Smith,Shallowater,103.28,174.63,106.59,142.88,424.11,Unlimited,SBD,M,
Boys,109.77,10,Jacob Fulton,Denver City,109.77,147.42,111.13,133.81,392.36,Unlimited,SBD,M,
Boys,124.74,1,Carlos Salcido,Stanton,124.74,317.51,163.29,226.8,707.6,Unlimited,SBD,M,
Boys,124.74,2,Ryker Trantham,Shallowater,113.31,226.8,142.88,242.67,612.35,Unlimited,SBD,M,
Boys,124.74,3,Reno Deleon,Seminole,122.52,192.78,122.47,201.85,517.1,Unlimited,SBD,M,
Boys,124.74,4,Azrock Busch,Shallowater,124.74,192.78,124.74,192.78,510.29,Unlimited,SBD,M,
Boys,124.74,5,Kaden Byrum,Slaton,124.74,181.44,124.74,197.31,503.49,Unlimited,SBD,M,
Boys,124.74,6,Brenden Garcia,Seminole,116.85,192.78,124.74,170.1,487.61,Unlimited,SBD,M,
Boys,124.74,7,Xzarius Vasquez,Seminole,114.99,167.83,102.06,183.7,453.59,Unlimited,SBD,M,
Boys,124.74,8,Tagan Salgado,Stanton,124.74,176.9,120.2,133.81,430.91,Unlimited,SBD,M,
Boys,124.74,9,Ryder Valdez,Plains,124.74,124.74,79.38,129.27,333.39,Unlimited,SBD,M,
Boys,124.74,10,Jose Martinez,Denver City,111.13,77.11,77.11,120.2,274.42,Unlimited,SBD,M,
Boys,139.71,1,Jaysyn Dobbs,Shallowater,139.71,240.4,165.56,226.8,632.76,Unlimited,SBD,M,
Boys,139.71,2,Carlos Lara,Seminole,127.1,183.7,120.2,217.72,521.63,Unlimited,SBD,M,
Boys,139.71+,1,Briones Jr,Denver City,158.76,263.08,163.29,231.33,657.71,Unlimited,SBD,M,
Boys,139.71+,2,Julian Cardenas,Denver City,142.43,158.76,124.74,149.69,433.18,Unlimited,SBD,M,
Boys,,NS,Joel Madrid,Denver City,,,,,,Unlimited,SBD,M,
