{
  "name": "",
  "css_prefix_text": "icon-",
  "css_use_suffix": false,
  "hinting": true,
  "units_per_em": 1000,
  "ascent": 850,
  "glyphs": [
    {
      "uid": "9248ce8062fb4707a6919bfe9ac1af8e",
      "css": "popup",
      "code": 59392,
      "src": "entypo"
    },
    {
      "uid": "4c1ef492f1d2c39a2250ae457cee2a6e",
      "css": "instagram",
      "code": 61805,
      "src": "fontawesome"
    },
    {
      "uid": "627abcdb627cb1789e009c08e2678ef9",
      "css": "twitter",
      "code": 61593,
      "src": "fontawesome"
    },
    {
      "uid": "8e04c98c8f5ca0a035776e3001ad2638",
      "css": "facebook",
      "code": 61594,
      "src": "fontawesome"
    },
    {
      "uid": "e9107949dd6c9e8ab2b29ae07156e38c",
      "css": "linkedin",
      "code": 61665,
      "src": "fontawesome"
    },
    {
      "uid": "4oaz56fmzfvx7vry2o540n9l4z79fz8t",
      "css": "right",
      "code": 59393,
      "src": "typicons"
    },
    {
      "uid": "749e7d90a9182938180f1d2d8c33584e",
      "css": "right-open",
      "code": 59394,
      "src": "entypo"
    },
    {
      "uid": "448a5c113676227130c1f474126c880f",
      "css": "social",
      "code": 59395,
      "src": "custom_icons",
      "selected": true,
      "svg": {
        "path": "M866.5 0A228.7 228.7 0 0 0 674.3 109.9 361.5 361.5 0 0 1 787.7 375.8 353.5 353.5 0 0 1 773.5 476.9 220.4 220.4 0 0 0 866.5 500.6 243.5 243.5 0 0 0 1102.8 251 243.5 243.5 0 0 0 866.5 1.2ZM393.9 124.8A243.5 243.5 0 0 0 157.6 374.5 243.5 243.5 0 0 0 393.9 624.2 243.5 243.5 0 0 0 630.2 374.5 243.5 243.5 0 0 0 393.9 124.8ZM1142.2 519.4A398.5 398.5 0 0 1 875.9 624.2 251.1 251.1 0 0 1 945.3 791.5V873.9H1260.4V666.7C1260.4 601.7 1211.5 545.6 1142.2 518.1ZM118.2 644.2C48.8 671.7 0 727.8 0 792.7V1000H787.7V792.7C787.7 727.8 738.9 671.6 669.6 644.2A399 399 0 0 1 393.9 749.1 404.8 404.8 0 0 1 118.2 644.2Z",
        "width": 1260
      },
      "search": [
        "icon"
      ]
    },
    {
      "uid": "7ca41fd0715eb83b90f23d0a79391865",
      "css": "work",
      "code": 59396,
      "src": "custom_icons",
      "selected": true,
      "svg": {
        "path": "M500 0A500 500 0 1 0 1000 500 500.2 500.2 0 0 0 500 0ZM300 775A125 125 0 1 1 425 650 125 125 0 0 1 300 775ZM375 300A125 125 0 1 1 500 425 125 125 0 0 1 375 300ZM700 775A125 125 0 1 1 825 650 125 125 0 0 1 700 775Z",
        "width": 1000
      },
      "search": [
        "icon"
      ]
    },
    {
      "uid": "034808277ff2544166ee6c8cec773608",
      "css": "fitness",
      "code": 59397,
      "src": "custom_icons",
      "selected": true,
      "svg": {
        "path": "M909.3 643L979.1 571.6 909.3 500 734.3 678.6 314.7 250 489.6 71.4 419.7 0 349.8 71.4 279.7 0 174.9 107 104.7 35.6 34.8 107 104.7 178.4 0 285.6 69.9 357 0 428.6 69.9 500 244.8 321.4 664.5 750 489.6 928.6 559.5 1000 629.4 928.6 699.3 1000 804 893 873.9 964.3 943.8 892.9 873.9 821.5 978.7 714.6Z",
        "width": 979
      },
      "search": [
        "icon"
      ]
    },
    {
      "uid": "b27f06dea21ba962d3513204b7fb71cf",
      "css": "nutritions",
      "code": 59398,
      "src": "custom_icons",
      "selected": true,
      "svg": {
        "path": "M177.4 0.3S446.3-16.3 421.3 210.7C421.3 210.7 459.8 59.7 629 128.9 629 128.9 593.3 278.1 451.6 241.8 451.6 241.8 481 131.7 584.8 127.7 584.8 127.7 504.4 106.9 419.3 226.1 419.3 226.1 379.4 35.6 230.6 25A223.3 223.3 0 0 1 387.1 241.7C387.1 241.9 172.6 255.8 177.4 0.2ZM806.4 636.5A519.4 519.4 0 0 1 741.9 903.2C656.8 965.5 530.2 999.9 403.2 999.9S149.6 965.4 64.5 903.2A519.4 519.4 0 0 1 0 636.5 525.5 525.5 0 0 1 80.6 371 540.3 540.3 0 0 1 403.2 273 538.5 538.5 0 0 1 725.7 371 525.5 525.5 0 0 1 806.4 636.5ZM241.9 846.8A56.4 56.4 0 1 0 185.5 903.2 56.4 56.4 0 0 0 241.9 846.8ZM241.9 713.4A56.4 56.4 0 1 0 185.5 769.8 56.4 56.4 0 0 0 241.9 713.3ZM241.9 580A56.4 56.4 0 1 0 185.5 636.4 56.4 56.4 0 0 0 241.9 579.9ZM387.1 846.8A56.4 56.4 0 1 0 330.6 903.2 56.4 56.4 0 0 0 387.1 846.8ZM387.1 713.4A56.4 56.4 0 1 0 330.6 769.8 56.4 56.4 0 0 0 387.1 713.3ZM387.1 580A56.4 56.4 0 1 0 330.6 636.3 56.4 56.4 0 0 0 387.1 579.9ZM532.2 846.8A56.4 56.4 0 1 0 475.8 903.2 56.4 56.4 0 0 0 532.2 846.8ZM532.2 713.4A56.4 56.4 0 1 0 475.8 769.8 56.4 56.4 0 0 0 532.2 713.3ZM532.2 580A56.4 56.4 0 1 0 475.8 636.4 56.4 56.4 0 0 0 532.2 579.9ZM677.4 846.8A56.4 56.4 0 1 0 620.9 903.2 56.4 56.4 0 0 0 677.4 846.8ZM677.4 713.4A56.4 56.4 0 1 0 620.9 769.8 56.4 56.4 0 0 0 677.4 713.3ZM677.4 580A56.4 56.4 0 1 0 620.9 636.4 56.4 56.4 0 0 0 677.4 579.9ZM725.7 500.1A504.2 504.2 0 0 0 693.5 387.2 653.5 653.5 0 0 0 403.2 322.7 653.5 653.5 0 0 0 112.9 387.1 501.4 501.4 0 0 0 80.6 500 1793 1793 0 0 1 403.2 470.2 1793.1 1793.1 0 0 1 725.7 500Z",
        "width": 806
      },
      "search": [
        "icon"
      ]
    },
    {
      "uid": "0f6ed568c3f4d9f47ecd8d02f440c647",
      "css": "connections",
      "code": 59399,
      "src": "custom_icons",
      "selected": true,
      "svg": {
        "path": "M1088.5 769.2C1050.2 755.5 987.3 754.8 959.7 744.2A182.1 182.1 0 0 1 900.1 716.5 368.5 368.5 0 0 1 890.3 618.8 157.8 157.8 0 0 0 924.2 570.8 533.2 533.2 0 0 0 940.5 476.6S963.1 486.2 972 440.9C979.6 401.8 994 381.3 990.2 352.5S970.3 330.6 970.3 330.6 990.2 301.4 990.2 202.4C990.2 100.3 913.1-0.1 768.8-0.1S547.1 100.7 547.1 202.4C547.1 301.4 566.7 330.6 566.7 330.6S550.6 323.7 546.8 352.5 557.1 401.9 564.9 440.9C573.9 486.7 596.5 476.6 596.5 476.6A538.4 538.4 0 0 0 612.8 570.8 157.8 157.8 0 0 0 646.7 619 368.5 368.5 0 0 1 636.9 716.7 175.2 175.2 0 0 1 577.2 744.1C549.8 754.7 487.1 756 448.4 769.8A241.7 241.7 0 0 0 291.4 1000.1H1245.2A241.4 241.4 0 0 0 1088.5 769.2ZM371.9 602.5S453.8 599.7 486.2 570.6C433.1 490 461.9 396.1 450.9 308.4S390.2 168.6 290.8 168.6H289.5A145 145 0 0 0 130.8 308.4C119.8 395.8 150.4 500.3 95.8 570.6 128.5 600 210.6 599 210.6 599H210.6A173.6 173.6 0 0 1 207.4 656.6 86.5 86.5 0 0 1 166.3 675.5 795.2 795.2 0 0 0 77.5 700.1 144.3 144.3 0 0 0 0 827.5H275.2C282.7 800.1 334.5 751.1 384.9 725.4A230.1 230.1 0 0 1 469.5 707.5S482.6 687 439.7 679.1A292.1 292.1 0 0 1 373.9 656.2C367.4 648.7 371.9 602.5 371.9 602.5ZM1166.9 602.5S1085 599.7 1052.6 570.6C1105.7 490 1076.9 396.1 1087.9 308.4S1148.5 168.6 1247.9 168.6H1249.3A145 145 0 0 1 1408 308.4C1419 395.8 1388.4 500.3 1442.9 570.6 1410.3 600 1328.1 599 1328.1 599H1328.1A173.6 173.6 0 0 0 1331.4 656.6 86.5 86.5 0 0 0 1372.5 675.5 795.2 795.2 0 0 1 1461.3 700.1 144.3 144.3 0 0 1 1538.7 827.5H1263.6C1256 800.1 1204.3 751.1 1153.9 725.4A230.1 230.1 0 0 0 1069.2 707.5S1056.1 687 1099 679.1A292.1 292.1 0 0 0 1164.8 656.2C1171.4 648.7 1166.9 602.5 1166.9 602.5Z",
        "width": 1539
      },
      "search": [
        "icon"
      ]
    },
    {
      "uid": "219109ef303a3029ddee8fc5b9a7b06f",
      "css": "climate",
      "code": 59400,
      "src": "custom_icons",
      "selected": true,
      "svg": {
        "path": "M457.6 153.8A37 37 0 0 0 492.8 115.4V38.5A35.3 35.3 0 1 0 422.4 38.5V115.4A37 37 0 0 0 457.6 153.8ZM731.5 255.2L781.3 200.8A41 41 0 0 0 781.3 146.4 33.1 33.1 0 0 0 731.5 146.4L681.7 200.8A41 41 0 0 0 681.7 255.2 33.1 33.1 0 0 0 731.4 255.2ZM35.2 538.5H105.6A38.6 38.6 0 0 0 105.6 461.5H35.2A38.6 38.6 0 0 0 35.2 538.5ZM774.5 500A37 37 0 0 0 809.7 538.5H880.1A38.6 38.6 0 0 0 880.1 461.5H809.7A37 37 0 0 0 774.5 500ZM183.8 255.2A33.1 33.1 0 0 0 233.5 255.2 41 41 0 0 0 233.5 200.8L183.8 146.4A33.1 33.1 0 0 0 134 146.4 41 41 0 0 0 134 200.8ZM214.8 538.5H285.2A208 208 0 0 1 281.6 500C281.6 393.7 360.4 307.7 457.6 307.7S633.6 393.8 633.6 500A207.8 207.8 0 0 1 630.1 538.5H700.5A279.5 279.5 0 0 0 704 500C704 351.6 593.5 230.8 457.6 230.8S211.3 351.6 211.3 500A294.7 294.7 0 0 0 214.8 538.5ZM880.1 615.3H35.2A38.6 38.6 0 0 0 35.2 692.2H880.1A38.6 38.6 0 0 0 880.1 615.3ZM880.1 769.1H35.2A38.6 38.6 0 0 0 35.2 846.1H880.1A38.6 38.6 0 0 0 880.1 769.1ZM880.1 923H35.2A38.6 38.6 0 0 0 35.2 999.9H880.1A38.6 38.6 0 0 0 880.1 923Z",
        "width": 915
      },
      "search": [
        "icon"
      ]
    },
    {
      "uid": "9dcf5ff594f4309b6b11d876078dee05",
      "css": "finger",
      "code": 59401,
      "src": "custom_icons",
      "selected": true,
      "svg": {
        "path": "M1333.3 353.3A117.4 117.4 0 0 1 1216.7 467.4H956.6A128.1 128.1 0 0 1 940.2 652.1 119.3 119.3 0 0 1 897.4 814.4C920.7 942.4 840.2 1000 708.5 1000 701.3 1000 673.9 999.5 666.8 999.5 505.4 1000 466.6 918.6 344.6 899.7A62.4 62.4 0 0 1 291.8 838V391.3H291.8A125 125 0 0 1 365.9 277.1C441.1 243.3 614.4 149.4 645.9 75.7A111.1 111.1 0 0 1 750 0 125.1 125.1 0 0 1 864.8 174.1 354 354 0 0 1 827.8 239H1216.7A119.3 119.3 0 0 1 1333.3 353.3ZM250 354.1V854.1A62.5 62.5 0 0 1 187.5 916.7H62.5A62.5 62.5 0 0 1 0 854.2V354.2A62.5 62.5 0 0 1 62.5 291.7H187.5A62.5 62.5 0 0 1 250 354.2ZM177.1 791.7A52.1 52.1 0 1 0 125 843.7 52.1 52.1 0 0 0 177.1 791.7Z",
        "width": 1333
      },
      "search": [
        "icon"
      ]
    }
  ]
}