<?xml version="1.0" standalone="no"?>
<!DOCTYPE svg PUBLIC "-//W3C//DTD SVG 1.1//EN" "http://www.w3.org/Graphics/SVG/1.1/DTD/svg11.dtd">
<svg xmlns="http://www.w3.org/2000/svg">
<metadata>Copyright (C) 2022 by original authors @ fontello.com</metadata>
<defs>
<font id="fontello" horiz-adv-x="1000" >
<font-face font-family="fontello" font-weight="400" font-stretch="normal" units-per-em="1000" ascent="850" descent="-150" />
<missing-glyph horiz-adv-x="1000" />
<glyph glyph-name="popup" unicode="&#xe800;" d="M700 750q42 0 71-29t29-71l0-400q0-40-29-70t-71-30l-400 0q-40 0-70 30t-30 70l0 402q0 40 29 69t71 29l400 0z m0-500l0 400-400 0 0-400 400 0z m-600 100l0-300 300 0 0-100-300 0q-40 0-70 30t-30 70l0 300 100 0z" horiz-adv-x="800" />

<glyph glyph-name="right" unicode="&#xe801;" d="M399 684q31 31 74 31t73-31l334-335-334-334q-30-30-73-30t-74 30q-31 31-31 74t31 74l82 82-377 0q-44 0-74 31t-30 73q0 44 31 74t73 31l377 0-82 82q-31 32-31 75t31 73z" horiz-adv-x="880" />

<glyph glyph-name="right-open" unicode="&#xe802;" d="M98 626l226-236q16-16 16-40 0-22-16-38l-226-236q-16-16-40-16t-40 16q-36 36 0 80l186 194-186 196q-36 44 0 80 16 16 41 16t39-16z" horiz-adv-x="340" />

<glyph glyph-name="social" unicode="&#xe803;" d="M867 850a229 229 0 0 1-193-110 362 362 0 0 0 114-266 354 354 0 0 0-14-101 220 220 0 0 1 93-24 244 244 0 0 1 236 250 244 244 0 0 1-236 250z m-473-125a244 244 0 0 1-236-249 244 244 0 0 1 236-250 244 244 0 0 1 236 250 244 244 0 0 1-236 249z m748-394a399 399 0 0 0-266-105 251 251 0 0 0 69-167v-83h315v207c0 65-48 121-118 149z m-1024-125c-69-28-118-84-118-149v-207h788v207c0 65-49 121-118 149a399 399 0 0 0-276-105 405 405 0 0 0-276 105z" horiz-adv-x="1260" />

<glyph glyph-name="work" unicode="&#xe804;" d="M500 850a500 500 0 1 1 500-500 500 500 0 0 1-500 500z m-200-775a125 125 0 1 0 125 125 125 125 0 0 0-125-125z m75 475a125 125 0 1 0 125-125 125 125 0 0 0-125 125z m325-475a125 125 0 1 0 125 125 125 125 0 0 0-125-125z" horiz-adv-x="1000" />

<glyph glyph-name="fitness" unicode="&#xe805;" d="M909 207l70 71-70 72-175-179-419 429 175 179-70 71-70-71-70 71-105-107-70 71-70-71 70-71-105-108 70-71-70-72 70-71 175 179 420-429-175-179 70-71 69 71 70-71 105 107 70-71 70 71-70 72 105 106z" horiz-adv-x="979" />

<glyph glyph-name="nutritions" unicode="&#xe806;" d="M177 850s269 16 244-211c0 0 39 151 208 82 0 0-36-149-177-113 0 0 29 110 133 114 0 0-81 21-166-98 0 0-40 190-188 201a223 223 0 0 0 156-217c0 0-214-14-210 242z m629-636a519 519 0 0 0-64-267c-85-63-212-97-339-97s-253 35-338 97a519 519 0 0 0-65 267 526 526 0 0 0 81 265 540 540 0 0 0 322 98 539 539 0 0 0 323-98 526 526 0 0 0 80-265z m-564-211a56 56 0 1 1-56-56 56 56 0 0 1 56 56z m0 134a56 56 0 1 1-56-57 56 56 0 0 1 56 57z m0 133a56 56 0 1 1-56-56 56 56 0 0 1 56 56z m145-267a56 56 0 1 1-56-56 56 56 0 0 1 56 56z m0 134a56 56 0 1 1-56-57 56 56 0 0 1 56 57z m0 133a56 56 0 1 1-56-56 56 56 0 0 1 56 56z m145-267a56 56 0 1 1-56-56 56 56 0 0 1 56 56z m0 134a56 56 0 1 1-56-57 56 56 0 0 1 56 57z m0 133a56 56 0 1 1-56-56 56 56 0 0 1 56 56z m145-267a56 56 0 1 1-56-56 56 56 0 0 1 56 56z m0 134a56 56 0 1 1-56-57 56 56 0 0 1 56 57z m0 133a56 56 0 1 1-56-56 56 56 0 0 1 56 56z m49 80a504 504 0 0 1-32 113 654 654 0 0 1-291 64 654 654 0 0 1-290-64 501 501 0 0 1-32-113 1793 1793 0 0 0 322 30 1793 1793 0 0 0 323-30z" horiz-adv-x="806" />

<glyph glyph-name="connections" unicode="&#xe807;" d="M1089 81c-39 14-102 14-129 25a182 182 0 0 0-60 28 369 369 0 0 0-10 97 158 158 0 0 1 34 48 533 533 0 0 1 17 94s22-9 31 36c8 39 22 60 18 89s-20 21-20 21 20 30 20 129c0 102-77 202-221 202s-222-101-222-202c0-99 20-129 20-129s-16 7-20-21 10-50 18-89c9-46 32-36 32-36a538 538 0 0 1 16-94 158 158 0 0 1 34-48 369 369 0 0 0-10-98 175 175 0 0 0-60-27c-27-11-90-12-129-26a242 242 0 0 1-157-230h954a241 241 0 0 1-156 231z m-717 167s82 2 114 31c-53 81-24 175-35 263s-61 139-160 139h-1a145 145 0 0 1-159-139c-11-88 19-192-35-263 33-29 115-28 115-28h0a174 174 0 0 0-4-58 87 87 0 0 0-41-18 795 795 0 0 1-88-25 144 144 0 0 1-78-127h275c8 27 60 76 110 102a230 230 0 0 0 85 18s13 20-30 28a292 292 0 0 0-66 23c-7 7-2 54-2 54z m795 0s-82 2-114 31c53 81 24 175 35 263s61 139 160 139h1a145 145 0 0 0 159-139c11-88-20-192 35-263-33-29-115-28-115-28h0a174 174 0 0 1 3-58 87 87 0 0 1 42-18 795 795 0 0 0 88-25 144 144 0 0 0 78-127h-275c-8 27-60 76-110 102a230 230 0 0 1-85 18s-13 20 30 28a292 292 0 0 1 66 23c6 7 2 54 2 54z" horiz-adv-x="1539" />

<glyph glyph-name="climate" unicode="&#xe808;" d="M458 696a37 37 0 0 1 35 39v77a35 35 0 1 1-71 0v-77a37 37 0 0 1 36-39z m274-101l49 54a41 41 0 0 1 0 55 33 33 0 0 1-49 0l-50-55a41 41 0 0 1 0-54 33 33 0 0 1 49 0z m-697-283h71a39 39 0 0 1 0 77h-71a39 39 0 0 1 0-77z m740 38a37 37 0 0 1 35-38h70a39 39 0 0 1 0 77h-70a37 37 0 0 1-35-39z m-591 245a33 33 0 0 1 50 0 41 41 0 0 1 0 54l-50 55a33 33 0 0 1-50 0 41 41 0 0 1 0-55z m31-283h70a208 208 0 0 0-3 38c0 106 78 192 176 192s176-86 176-192a208 208 0 0 0-4-38h71a280 280 0 0 1 3 38c0 148-110 269-246 269s-247-121-247-269a295 295 0 0 1 4-38z m665-77h-845a39 39 0 0 1 0-77h845a39 39 0 0 1 0 77z m0-154h-845a39 39 0 0 1 0-77h845a39 39 0 0 1 0 77z m0-154h-845a39 39 0 0 1 0-77h845a39 39 0 0 1 0 77z" horiz-adv-x="915" />

<glyph glyph-name="finger" unicode="&#xe809;" d="M1333 497a117 117 0 0 0-116-114h-260a128 128 0 0 0-17-185 119 119 0 0 0-43-162c24-128-57-186-188-186-8 0-35 0-42 0-162 0-200 81-322 100a62 62 0 0 0-53 62v447h0a125 125 0 0 0 74 114c75 34 248 128 280 201a111 111 0 0 0 104 76 125 125 0 0 0 115-174 354 354 0 0 0-37-65h389a119 119 0 0 0 116-114z m-1083-1v-500a63 63 0 0 0-62-63h-125a63 63 0 0 0-63 63v500a63 63 0 0 0 63 62h125a63 63 0 0 0 62-62z m-73-438a52 52 0 1 1-52-52 52 52 0 0 1 52 52z" horiz-adv-x="1333" />

<glyph glyph-name="twitter" unicode="&#xf099;" d="M904 622q-37-54-90-93 0-8 0-23 0-73-21-145t-64-139-103-117-144-82-181-30q-151 0-276 81 19-2 43-2 126 0 224 77-59 1-105 36t-64 89q19-3 34-3 24 0 48 6-63 13-104 62t-41 115v2q38-21 82-23-37 25-59 64t-22 86q0 49 25 91 68-83 164-133t208-55q-5 21-5 41 0 75 53 127t127 53q79 0 132-57 61 12 115 44-21-64-80-100 52 6 104 28z" horiz-adv-x="928.6" />

<glyph glyph-name="facebook" unicode="&#xf09a;" d="M535 843v-147h-87q-48 0-65-20t-17-60v-106h164l-22-165h-142v-424h-171v424h-142v165h142v122q0 104 58 161t155 57q82 0 127-7z" horiz-adv-x="571.4" />

<glyph glyph-name="linkedin" unicode="&#xf0e1;" d="M195 501v-553h-184v553h184z m12 171q0-41-29-68t-75-27h-1q-46 0-74 27t-28 68q0 41 29 68t75 27 74-27 29-68z m650-407v-317h-183v296q0 59-23 92t-71 33q-35 0-58-19t-36-48q-6-17-6-45v-309h-184q1 223 1 361t0 165l-1 27h184v-80h-1q11 18 23 31t31 29 49 24 64 9q95 0 153-63t58-186z" horiz-adv-x="857.1" />

<glyph glyph-name="instagram" unicode="&#xf16d;" d="M571 350q0 59-41 101t-101 42-101-42-42-101 42-101 101-42 101 42 41 101z m77 0q0-91-64-156t-155-64-156 64-64 156 64 156 156 64 155-64 64-156z m61 229q0-21-15-36t-37-15-36 15-15 36 15 36 36 15 37-15 15-36z m-280 123q-4 0-43 0t-59 0-54-2-57-5-40-11q-28-11-49-32t-33-49q-6-16-10-40t-6-58-1-53 0-59 0-43 0-43 0-59 1-53 6-58 10-40q12-28 33-49t49-32q16-6 40-11t57-5 54-2 59 0 43 0 42 0 59 0 54 2 58 5 39 11q28 11 50 32t32 49q6 16 10 40t6 58 1 53 0 59 0 43 0 43 0 59-1 53-6 58-10 40q-11 28-32 49t-50 32q-16 6-39 11t-58 5-54 2-59 0-42 0z m428-352q0-128-3-177-5-116-69-180t-179-69q-50-3-177-3t-177 3q-116 6-180 69t-69 180q-3 49-3 177t3 177q5 116 69 180t180 69q49 3 177 3t177-3q116-6 179-69t69-180q3-49 3-177z" horiz-adv-x="857.1" />
</font>
</defs>
</svg>
