{
  "links": {
    "main": "main ss",
    "chats": "chats",
    "settings": "settings",
    "login": "Already have an account? Sign in",
    "signup": "Don't have an account? Sign Up",
    "forgot_password": "Forgot password?"
  }
}
